------ Build started: Project: FreeSwitchVersion, Configuration: Debug Win32 ------
Generating switch_version.h
Downloading: http://svn.freeswitch.org/downloads/win32/svnversion.zip
Extracting: C:\Documents and Settings\sg\Desktop\freeswitch\w32\vsnet\Tools\svnversion.zip
Complete
Build log was saved at "file://c:\Documents and Settings\sg\Desktop\freeswitch\w32\vsnet\Debug\BuildLog.htm"
FreeSwitchVersion - 0 error(s), 0 warning(s)
------ Build started: Project: FreeSwitchCoreLib, Configuration: Debug Win32 ------
Performing Pre-Build Event...
Input Error: There is no file extension in "c:\Documents".
Project : error PRJ0019: A tool returned an error code from "Performing Pre-Build Event..."
Build log was saved at "file://c:\Documents and Settings\sg\Desktop\freeswitch\w32\vsnet\Debug\BuildLog.htm"
FreeSwitchCoreLib - 1 error(s), 0 warning(s)
------ Build started: Project: mod_perl, Configuration: Debug Win32 ------
Performing Pre-Build Event...
Compiling...
mod_perl.c
c:\documents and settings\sg\desktop\freeswitch\src\mod\languages\mod_perl\mod_perl.c(40) : fatal error C1083: Cannot open include file: 'EXTERN.h': No such file or directory
perlxsi.c
c:\documents and settings\sg\desktop\freeswitch\src\mod\languages\mod_perl\perlxsi.c(4) : fatal error C1083: Cannot open include file: 'EXTERN.h': No such file or directory
Generating Code...
Build log was saved at "file://c:\Documents and Settings\sg\Desktop\freeswitch\src\mod\languages\mod_perl\Debug\BuildLog.htm"
mod_perl - 2 error(s), 0 warning(s)
------ Build started: Project: fs_perl, Configuration: Debug Win32 ------
Compiling...
switch_swig.c
c:\documents and settings\sg\desktop\freeswitch\src\include\switch_apr.h(46) : fatal error C1083: Cannot open include file: 'apr.h': No such file or directory
Build log was saved at "file://c:\Documents and Settings\sg\Desktop\freeswitch\src\mod\languages\mod_perl\Debug\BuildLog.htm"
fs_perl - 1 error(s), 0 warning(s)
------ Skipped Build: Project: mod_cepstral, Configuration: Debug Win32 ------
Project not selected to build for this solution configuration
------ Build started: Project: mod_spidermonkey, Configuration: Debug Win32 ------
Performing Pre-Build Event...
Input Error: There is no file extension in "c:\Documents".
Project : error PRJ0019: A tool returned an error code from "Performing Pre-Build Event..."
Build log was saved at "file://c:\Documents and Settings\sg\Desktop\freeswitch\src\mod\languages\mod_spidermonkey\Debug\BuildLog.htm"
mod_spidermonkey - 1 error(s), 0 warning(s)
------ Skipped Build: Project: mod_ilbc, Configuration: Debug Win32 ------
Project not selected to build for this solution configuration
------ Build started: Project: mod_event_multicast, Configuration: Debug Win32 ------
Compiling...
mod_event_multicast.c
c:\documents and settings\sg\desktop\freeswitch\src\include\switch_apr.h(46) : fatal error C1083: Cannot open include file: 'apr.h': No such file or directory
Build log was saved at "file://c:\Documents and Settings\sg\Desktop\freeswitch\src\mod\event_handlers\mod_event_multicast\Debug\BuildLog.htm"
mod_event_multicast - 1 error(s), 0 warning(s)
------ Build started: Project: mod_zeroconf, Configuration: Debug Win32 ------
Performing Pre-Build Event...
Input Error: There is no file extension in "c:\Documents".
Project : error PRJ0019: A tool returned an error code from "Performing Pre-Build Event..."
Build log was saved at "file://c:\Documents and Settings\sg\Desktop\freeswitch\src\mod\event_handlers\mod_zeroconf\Debug\BuildLog.htm"
mod_zeroconf - 1 error(s), 0 warning(s)
------ Build started: Project: mod_dialplan_directory, Configuration: Debug Win32 ------
Compiling...
mod_dialplan_directory.c
c:\documents and settings\sg\desktop\freeswitch\src\include\switch_apr.h(46) : fatal error C1083: Cannot open include file: 'apr.h': No such file or directory
Build log was saved at "file://c:\Documents and Settings\sg\Desktop\freeswitch\src\mod\dialplans\mod_dialplan_directory\Debug\BuildLog.htm"
mod_dialplan_directory - 1 error(s), 0 warning(s)
------ Build started: Project: mod_ldap, Configuration: Debug Win32 ------
Performing Pre-Build Event...
Input Error: There is no file extension in "c:\Documents".
Project : error PRJ0019: A tool returned an error code from "Performing Pre-Build Event..."
Build log was saved at "file://c:\Documents and Settings\sg\Desktop\freeswitch\src\mod\directories\mod_ldap\Debug\BuildLog.htm"
mod_ldap - 1 error(s), 0 warning(s)
------ Build started: Project: mod_ivrtest, Configuration: Debug Win32 ------
Compiling...
mod_ivrtest.c
c:\documents and settings\sg\desktop\freeswitch\src\include\switch_apr.h(46) : fatal error C1083: Cannot open include file: 'apr.h': No such file or directory
Build log was saved at "file://c:\Documents and Settings\sg\Desktop\freeswitch\src\mod\applications\mod_ivrtest\Debug\BuildLog.htm"
mod_ivrtest - 1 error(s), 0 warning(s)
------ Build started: Project: mod_pcre, Configuration: Debug Win32 ------
Performing Pre-Build Event...
Input Error: There is no file extension in "c:\Documents".
Project : error PRJ0019: A tool returned an error code from "Performing Pre-Build Event..."
Build log was saved at "file://c:\Documents and Settings\sg\Desktop\freeswitch\src\mod\dialplans\mod_pcre\Debug\BuildLog.htm"
mod_pcre - 1 error(s), 0 warning(s)
------ Build started: Project: mod_echo, Configuration: Debug Win32 ------
Compiling...
mod_echo.c
c:\documents and settings\sg\desktop\freeswitch\src\include\switch_apr.h(46) : fatal error C1083: Cannot open include file: 'apr.h': No such file or directory
Build log was saved at "file://c:\Documents and Settings\sg\Desktop\freeswitch\src\mod\applications\mod_echo\Debug\BuildLog.htm"
mod_echo - 1 error(s), 0 warning(s)
------ Build started: Project: mod_woomera, Configuration: Debug Win32 ------
Compiling...
mod_woomera.c
c:\documents and settings\sg\desktop\freeswitch\src\include\switch_apr.h(46) : fatal error C1083: Cannot open include file: 'apr.h': No such file or directory
Build log was saved at "file://c:\Documents and Settings\sg\Desktop\freeswitch\src\mod\endpoints\mod_woomera\Debug\BuildLog.htm"
mod_woomera - 1 error(s), 0 warning(s)
------ Build started: Project: mod_speex, Configuration: Debug Win32 ------
Performing Pre-Build Event...
Input Error: There is no file extension in "c:\Documents".
Project : error PRJ0019: A tool returned an error code from "Performing Pre-Build Event..."
Build log was saved at "file://c:\Documents and Settings\sg\Desktop\freeswitch\src\mod\codecs\mod_speex\Debug\BuildLog.htm"
mod_speex - 1 error(s), 0 warning(s)
------ Build started: Project: mod_softtimer, Configuration: Debug Win32 ------
Compiling...
mod_softtimer.c
c:\documents and settings\sg\desktop\freeswitch\src\include\switch_apr.h(46) : fatal error C1083: Cannot open include file: 'apr.h': No such file or directory
Build log was saved at "file://c:\Documents and Settings\sg\Desktop\freeswitch\src\mod\timers\mod_softtimer\Debug\BuildLog.htm"
mod_softtimer - 1 error(s), 0 warning(s)
------ Build started: Project: mod_l16, Configuration: Debug Win32 ------
Compiling...
mod_l16.c
c:\documents and settings\sg\desktop\freeswitch\src\include\switch_apr.h(46) : fatal error C1083: Cannot open include file: 'apr.h': No such file or directory
Build log was saved at "file://c:\Documents and Settings\sg\Desktop\freeswitch\src\mod\codecs\mod_l16\Debug\BuildLog.htm"
mod_l16 - 1 error(s), 0 warning(s)
------ Build started: Project: mod_PortAudio, Configuration: Debug Win32 ------
Performing Pre-Build Event...
Input Error: There is no file extension in "c:\Documents".
Project : error PRJ0019: A tool returned an error code from "Performing Pre-Build Event..."
Build log was saved at "file://c:\Documents and Settings\sg\Desktop\freeswitch\src\mod\endpoints\mod_portaudio\Debug\BuildLog.htm"
mod_PortAudio - 1 error(s), 0 warning(s)
------ Build started: Project: mod_playback, Configuration: Debug Win32 ------
Compiling...
mod_playback.c
c:\documents and settings\sg\desktop\freeswitch\src\include\switch_apr.h(46) : fatal error C1083: Cannot open include file: 'apr.h': No such file or directory
Build log was saved at "file://c:\Documents and Settings\sg\Desktop\freeswitch\src\mod\applications\mod_playback\Debug\BuildLog.htm"
mod_playback - 1 error(s), 0 warning(s)
------ Build started: Project: mod_iax, Configuration: Debug Win32 ------
Performing Pre-Build Event...
Input Error: There is no file extension in "c:\Documents".
Project : error PRJ0019: A tool returned an error code from "Performing Pre-Build Event..."
Build log was saved at "file://c:\Documents and Settings\sg\Desktop\freeswitch\src\mod\endpoints\mod_iax\Debug\BuildLog.htm"
mod_iax - 1 error(s), 0 warning(s)
------ Build started: Project: mod_g711, Configuration: Debug Win32 ------
Compiling...
mod_g711.c
c:\documents and settings\sg\desktop\freeswitch\src\include\switch_apr.h(46) : fatal error C1083: Cannot open include file: 'apr.h': No such file or directory
Build log was saved at "file://c:\Documents and Settings\sg\Desktop\freeswitch\src\mod\codecs\mod_g711\Debug\BuildLog.htm"
mod_g711 - 1 error(s), 0 warning(s)
------ Build started: Project: mod_exosip, Configuration: Debug Win32 ------
Performing Pre-Build Event...
Input Error: There is no file extension in "c:\Documents".
Project : error PRJ0019: A tool returned an error code from "Performing Pre-Build Event..."
Build log was saved at "file://c:\Documents and Settings\sg\Desktop\freeswitch\src\mod\endpoints\mod_exosip\Debug\BuildLog.htm"
mod_exosip - 1 error(s), 0 warning(s)
------ Build started: Project: mod_event_test, Configuration: Debug Win32 ------
Compiling...
mod_event_test.c
c:\documents and settings\sg\desktop\freeswitch\src\include\switch_apr.h(46) : fatal error C1083: Cannot open include file: 'apr.h': No such file or directory
Build log was saved at "file://c:\Documents and Settings\sg\Desktop\freeswitch\src\mod\event_handlers\mod_event_test\Debug\BuildLog.htm"
mod_event_test - 1 error(s), 0 warning(s)
------ Build started: Project: mod_dialplan_demo, Configuration: Debug Win32 ------
Compiling...
mod_dialplan_demo.c
c:\documents and settings\sg\desktop\freeswitch\src\include\switch_apr.h(46) : fatal error C1083: Cannot open include file: 'apr.h': No such file or directory
Build log was saved at "file://c:\Documents and Settings\sg\Desktop\freeswitch\src\mod\dialplans\mod_dialplan_demo\Debug\BuildLog.htm"
mod_dialplan_demo - 1 error(s), 0 warning(s)
------ Build started: Project: mod_bridgecall, Configuration: Debug Win32 ------
Compiling...
mod_bridgecall.c
c:\documents and settings\sg\desktop\freeswitch\src\include\switch_apr.h(46) : fatal error C1083: Cannot open include file: 'apr.h': No such file or directory
Build log was saved at "file://c:\Documents and Settings\sg\Desktop\freeswitch\src\mod\applications\mod_bridgecall\Debug\BuildLog.htm"
mod_bridgecall - 1 error(s), 0 warning(s)
------ Build started: Project: mod_sndfile, Configuration: Debug Win32 ------
Performing Pre-Build Event...
Input Error: There is no file extension in "c:\Documents".
Project : error PRJ0019: A tool returned an error code from "Performing Pre-Build Event..."
Build log was saved at "file://c:\Documents and Settings\sg\Desktop\freeswitch\src\mod\formats\mod_sndfile\Debug\BuildLog.htm"
mod_sndfile - 1 error(s), 0 warning(s)
------ Build started: Project: mod_xmpp_event, Configuration: Debug Win32 ------
Performing Pre-Build Event...
Input Error: There is no file extension in "c:\Documents".
Project : error PRJ0019: A tool returned an error code from "Performing Pre-Build Event..."
Build log was saved at "file://c:\Documents and Settings\sg\Desktop\freeswitch\src\mod\event_handlers\mod_xmpp_event\Debug\BuildLog.htm"
mod_xmpp_event - 1 error(s), 0 warning(s)
------ Build started: Project: mod_gsm, Configuration: Debug Win32 ------
Performing Pre-Build Event...
Input Error: There is no file extension in "c:\Documents".
Project : error PRJ0019: A tool returned an error code from "Performing Pre-Build Event..."
Build log was saved at "file://c:\Documents and Settings\sg\Desktop\freeswitch\src\mod\codecs\mod_gsm\Debug\BuildLog.htm"
mod_gsm - 1 error(s), 0 warning(s)
------ Skipped Build: Project: mod_g729, Configuration: Debug Win32 ------
Project not selected to build for this solution configuration
------ Build started: Project: mod_dingaling, Configuration: Debug Win32 ------
Performing Pre-Build Event...
Input Error: There is no file extension in "c:\Documents".
Project : error PRJ0019: A tool returned an error code from "Performing Pre-Build Event..."
Build log was saved at "file://c:\Documents and Settings\sg\Desktop\freeswitch\src\mod\endpoints\mod_dingaling\Debug\BuildLog.htm"
mod_dingaling - 1 error(s), 0 warning(s)
------ Build started: Project: FreeSwitchConsole, Configuration: Debug Win32 ------
Compiling...
switch.c
c:\documents and settings\sg\desktop\freeswitch\src\include\switch_apr.h(46) : fatal error C1083: Cannot open include file: 'apr.h': No such file or directory
Build log was saved at "file://c:\Documents and Settings\sg\Desktop\freeswitch\w32\vsnet\Debug\BuildLog.htm"
FreeSwitchConsole - 1 error(s), 0 warning(s)
========== Build: 1 succeeded, 28 failed, 1 up-to-date, 3 skipped ==========