All pastes #47485 Raw Edit

Unnamed

public text v1 · immutable
#47485 ·published 2006-03-29 18:14 UTC
rendered paste body
zhizn:/usr/local/distr/eaccelerator-0.9.4#   $PHP_PREFIX/bin/phpize
Configuring for:
PHP Api Version:         20041225
Zend Module Api No:      20050922
Zend Extension Api No:   220051025
zhizn:/usr/local/distr/eaccelerator-0.9.4#
zhizn:/usr/local/distr/eaccelerator-0.9.4#   ./configure \
>   --enable-eaccelerator=shared \
>   --with-php-config=$PHP_PREFIX/bin/php-config
....
 gcc -I. -I/usr/local/distr/eaccelerator-0.9.4 -DPHP_ATOM_INC -I/usr/local/distr/eaccelerator-0.9.4/include -I/usr/local/distr/eaccelerator-0.9.4/main -I/usr/local/distr/eaccelerator-0.9.4 -I/usr/include/php -I/usr/include/php/main -I/usr/include/php/TSRM -I/usr/include/php/Zend -I/usr/include/php/ext -DHAVE_CONFIG_H -g -O2 -c /usr/local/distr/eaccelerator-0.9.4/optimize.c  -fPIC -DPIC -o .libs/optimize.o
/usr/local/distr/eaccelerator-0.9.4/optimize.c: In function `compute_live_var':
/usr/local/distr/eaccelerator-0.9.4/optimize.c:253: error: `ZEND_UNSET_DIM_OBJ' undeclared (first use in this function)
/usr/local/distr/eaccelerator-0.9.4/optimize.c:253: error: (Each undeclared identifier is reported only once
/usr/local/distr/eaccelerator-0.9.4/optimize.c:253: error: for each function it appears in.)
/usr/local/distr/eaccelerator-0.9.4/optimize.c:260: error: `ZEND_JMP_NO_CTOR' undeclared (first use in this function)
/usr/local/distr/eaccelerator-0.9.4/optimize.c: In function `optimize_jmp':
/usr/local/distr/eaccelerator-0.9.4/optimize.c:1282: error: `ZEND_JMP_NO_CTOR' undeclared (first use in this function)
/usr/local/distr/eaccelerator-0.9.4/optimize.c: In function `optimize_bb':
/usr/local/distr/eaccelerator-0.9.4/optimize.c:2446: error: `ZEND_UNSET_DIM_OBJ' undeclared (first use in this function)
/usr/local/distr/eaccelerator-0.9.4/optimize.c: In function `build_cfg':
/usr/local/distr/eaccelerator-0.9.4/optimize.c:2724: error: `ZEND_JMP_NO_CTOR' undeclared (first use in this function)
/usr/local/distr/eaccelerator-0.9.4/optimize.c:2843: error: `ZEND_UNSET_DIM_OBJ' undeclared (first use in this function)
make: *** [optimize.lo] Îøèáêà 1