All pastes #46905 Raw Edit

Something

public text v1 · immutable
#46905 ·published 2006-03-25 03:37 UTC
rendered paste body
make
make  all-recursive
make[1]: Entering directory `/home/joshua/.themes/Alphacube-0.3'
Making all in kwin
make[2]: Entering directory `/home/joshua/.themes/Alphacube-0.3/kwin'
Making all in .
make[3]: Entering directory `/home/joshua/.themes/Alphacube-0.3/kwin'
if /bin/sh ../libtool --silent --mode=compile g++ -DHAVE_CONFIG_H -I. -I. -I.. -I./../../lib -I/usr/lib/qt3//include -I/usr/X11R6/include   -DQT_THREAD_SUPPORT  -D_REENTRANT  -Wnon-virtual-dtor -Wno-long-long -Wundef -Wall -W -Wpointer-arith -Wwrite-strings -O2 -fno-exceptions -fno-check-new -fno-common -MT Alphacube.lo -MD -MP -MF ".deps/Alphacube.Tpo" -c -o Alphacube.lo Alphacube.cpp; \
then mv -f ".deps/Alphacube.Tpo" ".deps/Alphacube.Plo"; else rm -f ".deps/Alphacube.Tpo"; exit 1; fi
In file included from Alphacube.cpp:43:
Alphacube.h:49:25: error: kdecoration.h: No such file or directory
Alphacube.h:50:32: error: kdecorationfactory.h: No such file or directory
/usr/lib/qt3//include/qtooltip.h:86: warning: 'class QToolTip' has virtual functions but non-virtual destructor
Alphacube.h:130: warning: non-local variable 'Alphacube::<anonymous struct> Alphacube::Settings_Param' uses anonymous type
Alphacube.h:141: error: expected class-name before '{' token
Alphacube.h:146: error: 'BorderSize' was not declared in this scope
Alphacube.h:146: error: template argument 1 is invalid
Alphacube.h:148: error: ISO C++ forbids declaration of 'KDecoration' with no type
Alphacube.h:148: error: 'KDecoration' declared as a 'virtual' field
Alphacube.h:148: error: expected ';' before '*' token
Alphacube.h:141: warning: 'class Alphacube::AlphacubeHandler' has virtual functions but non-virtual destructor
Alphacube.h:293: error: expected class-name before '{' token
Alphacube.h:298: error: expected `)' before '*' token
Alphacube.h:312: error: 'Position' does not name a type
Alphacube.h:293: warning: 'class Alphacube::AlphacubeClient' has virtual functions but non-virtual destructor
Alphacube.h: In member function 'int Alphacube::AlphacubeClient::width() const':
Alphacube.h:343: error: 'widget' was not declared in this scope
Alphacube.h: In member function 'int Alphacube::AlphacubeClient::height() const':
Alphacube.h:347: error: 'widget' was not declared in this scope
Alphacube.h: In member function 'bool Alphacube::AlphacubeClient::maximizedVertical() const':
Alphacube.h:351: error: 'maximizeMode' was not declared in this scope
Alphacube.h:351: error: 'MaximizeVertical' was not declared in this scope
/usr/lib/qt3//include/private/qucom_p.h: At global scope:
/usr/lib/qt3//include/private/qucom_p.h:69: warning: 'struct QUBuffer' has virtual functions but non-virtual destructor
/usr/lib/qt3//include/private/qucom_p.h:77: warning: 'struct QUType' has virtual functions but non-virtual destructor
/usr/lib/qt3//include/private/qucom_p.h:104: warning: 'struct QUType_Null' has virtual functions but non-virtual destructor
/usr/lib/qt3//include/private/qucom_p.h:287: warning: 'struct QUType_enum' has virtual functions but non-virtual destructor
/usr/lib/qt3//include/private/qucom_p.h:307: warning: 'struct QUType_ptr' has virtual functions but non-virtual destructor
/usr/lib/qt3//include/private/qucom_p.h:326: warning: 'struct QUType_iface' has virtual functions but non-virtual destructor
/usr/lib/qt3//include/private/qucom_p.h:345: warning: 'struct QUType_idisp' has virtual functions but non-virtual destructor
/usr/lib/qt3//include/private/qucom_p.h:364: warning: 'struct QUType_bool' has virtual functions but non-virtual destructor
/usr/lib/qt3//include/private/qucom_p.h:383: warning: 'struct QUType_int' has virtual functions but non-virtual destructor
/usr/lib/qt3//include/private/qucom_p.h:403: warning: 'struct QUType_double' has virtual functions but non-virtual destructor
/usr/lib/qt3//include/private/qucom_p.h:423: warning: 'struct QUType_charstar' has virtual functions but non-virtual destructor
/usr/lib/qt3//include/private/qucom_p.h:444: warning: 'struct QUType_QString' has virtual functions but non-virtual destructor
/usr/lib/qt3//include/private/qucomextra_p.h:65: warning: 'struct QUType_QVariant' has virtual functions but non-virtual destructor
/usr/lib/qt3//include/private/qucomextra_p.h:87: warning: 'struct QUType_varptr' has virtual functions but non-virtual destructor
Alphacube.moc: In static member function 'static QMetaObject* Alphacube::AlphacubeClient::staticMetaObject()':
Alphacube.moc:54: error: 'KDecoration' has not been declared
Alphacube.moc: In member function 'virtual void* Alphacube::AlphacubeClient::qt_cast(const char*)':
Alphacube.moc:78: error: 'KDecoration' has not been declared
Alphacube.moc: In member function 'virtual bool Alphacube::AlphacubeClient::qt_invoke(int, QUObject*)':
Alphacube.moc:87: error: 'KDecoration' has not been declared
Alphacube.moc: In member function 'virtual bool Alphacube::AlphacubeClient::qt_emit(int, QUObject*)':
Alphacube.moc:94: error: 'KDecoration' has not been declared
Alphacube.moc: In member function 'virtual bool Alphacube::AlphacubeClient::qt_property(int, int, QVariant*)':
Alphacube.moc:100: error: 'KDecoration' has not been declared
Alphacube.cpp: In member function 'void Alphacube::AlphacubeHandler::createPixmaps(bool)':
Alphacube.cpp:97: error: 'options' was not declared in this scope
Alphacube.cpp:98: error: 'BorderLarge' was not declared in this scope
Alphacube.cpp:102: error: 'BorderVeryLarge' was not declared in this scope
Alphacube.cpp:106: error: 'BorderTiny' was not declared in this scope
Alphacube.cpp:107: error: 'BorderNormal' was not declared in this scope
Alphacube.cpp:113: error: 'options' was not declared in this scope
Alphacube.cpp:121: error: 'KDecoration' has not been declared
Alphacube.cpp:121: error: 'ColorTitleBar' was not declared in this scope
Alphacube.cpp:122: error: 'KDecoration' has not been declared
Alphacube.cpp:122: error: 'ColorTitleBlend' was not declared in this scope
Alphacube.cpp:149: error: 'KDecoration' has not been declared
Alphacube.cpp:150: error: 'KDecoration' has not been declared
Alphacube.cpp: In member function 'QPixmap* Alphacube::AlphacubeHandler::loadPixmap(const QString&, bool)':
Alphacube.cpp:603: error: 'KDecoration' has not been declared
Alphacube.cpp:603: error: 'options' was not declared in this scope
Alphacube.cpp:603: error: 'ColorTitleBar' was not declared in this scope
Alphacube.cpp:604: error: 'KDecoration' has not been declared
Alphacube.cpp:604: error: 'ColorTitleBlend' was not declared in this scope
Alphacube.cpp:605: error: 'KDecoration' has not been declared
Alphacube.cpp:606: error: 'KDecoration' has not been declared
Alphacube.cpp:604: warning: unused variable 'activeBlendColor'
Alphacube.cpp:606: warning: unused variable 'inactiveBlendColor'
Alphacube.cpp: In member function 'virtual bool Alphacube::AlphacubeHandler::reset(long unsigned int)':
Alphacube.cpp:625: error: 'SettingBorder' was not declared in this scope
Alphacube.cpp:629: error: 'SettingFont' was not declared in this scope
Alphacube.cpp:634: error: 'SettingColors' was not declared in this scope
Alphacube.cpp:639: error: 'SettingButtons' was not declared in this scope
Alphacube.cpp:643: error: 'SettingTooltips' was not declared in this scope
Alphacube.cpp:663: error: 'resetDecorations' was not declared in this scope
Alphacube.cpp: At global scope:
Alphacube.cpp:735: error: expected constructor, destructor, or type conversion before '*' token
Alphacube.cpp:740: error: 'BorderSize' is not a member of 'Alphacube::AlphacubeHandler'
Alphacube.cpp:740: error: 'BorderSize' is not a member of 'Alphacube::AlphacubeHandler'
Alphacube.cpp:740: error: template argument 1 is invalid
Alphacube.cpp: In member function 'virtual int Alphacube::AlphacubeHandler::borderSizes() const':
Alphacube.cpp:743: error: 'BorderSize' was not declared in this scope
Alphacube.cpp:743: error: template argument 1 is invalid
Alphacube.cpp:743: error: 'BorderNormal' was not declared in this scope
Alphacube.cpp:743: error: 'BorderLarge' was not declared in this scope
Alphacube.cpp:743: error: 'BorderVeryLarge' was not declared in this scope
Alphacube.cpp: In constructor 'Alphacube::AlphacubeButton::AlphacubeButton(Alphacube::AlphacubeClient*, const char*, Alphacube::Button, const QString&, bool, int)':
Alphacube.cpp:747: error: 'class Alphacube::AlphacubeClient' has no member named 'widget'
Alphacube.cpp:762: error: 'class Alphacube::AlphacubeClient' has no member named 'isActive'
Alphacube.cpp:763: error: 'class Alphacube::AlphacubeClient' has no member named 'isActive'
Alphacube.cpp: At global scope:
Alphacube.cpp:747: warning: unused parameter 'bttstate'
Alphacube.cpp:747: warning: unused parameter 'bttstate'
Alphacube.cpp: In member function 'virtual void Alphacube::AlphacubeButton::drawButton(QPainter*)':
Alphacube.cpp:814: error: 'class Alphacube::AlphacubeClient' has no member named 'isActive'
Alphacube.cpp:816: error: 'class Alphacube::AlphacubeClient' has no member named 'isActive'
Alphacube.cpp:870: error: 'class Alphacube::AlphacubeClient' has no member named 'isActive'
Alphacube.cpp:874: error: 'class Alphacube::AlphacubeClient' has no member named 'isActive'
Alphacube.cpp:878: error: 'class Alphacube::AlphacubeClient' has no member named 'maximizeMode'
Alphacube.cpp:879: error: 'MaximizeFull' is not a member of 'Alphacube::AlphacubeClient'
Alphacube.cpp:882: error: 'class Alphacube::AlphacubeClient' has no member named 'isActive'
Alphacube.cpp:886: error: 'class Alphacube::AlphacubeClient' has no member named 'isActive'
Alphacube.cpp: At global scope:
Alphacube.cpp:993: error: expected `)' before '*' token
Alphacube.cpp: In member function 'virtual void Alphacube::AlphacubeClient::init()':
Alphacube.cpp:1015: error: 'WStaticContents' was not declared in this scope
Alphacube.cpp:1015: error: 'WNoAutoErase' was not declared in this scope
Alphacube.cpp:1015: error: 'createMainWidget' was not declared in this scope
Alphacube.cpp:1016: error: 'widget' was not declared in this scope
Alphacube.cpp: In member function 'void Alphacube::AlphacubeClient::createLayout()':
Alphacube.cpp:1043: error: 'widget' was not declared in this scope
Alphacube.cpp:1058: error: 'isActive' was not declared in this scope
Alphacube.cpp:1086: error: 'options' was not declared in this scope
Alphacube.cpp:1131: error: 'isPreview' was not declared in this scope
Alphacube.cpp: In member function 'virtual void Alphacube::AlphacubeClient::reset(long unsigned int)':
Alphacube.cpp:1152: error: 'widget' was not declared in this scope
Alphacube.cpp: In member function 'void Alphacube::AlphacubeClient::addButtons(QBoxLayout*, const QString&)':
Alphacube.cpp:1197: error: 'LeftButton' was not declared in this scope
Alphacube.cpp:1197: error: 'MidButton' was not declared in this scope
Alphacube.cpp:1197: error: 'RightButton' was not declared in this scope
Alphacube.cpp:1203: error: 'isMinimizable' was not declared in this scope
Alphacube.cpp:1207: error: 'connect' was not declared in this scope
Alphacube.cpp:1222: error: 'isMaximizable' was not declared in this scope
Alphacube.cpp:1226: error: 'connect' was not declared in this scope
Alphacube.cpp:1241: error: 'isCloseable' was not declared in this scope
Alphacube.cpp:1245: error: 'connect' was not declared in this scope
Alphacube.cpp:1264: error: 'providesContextHelp' was not declared in this scope
Alphacube.cpp:1267: error: 'connect' was not declared in this scope
Alphacube.cpp: In member function 'void Alphacube::AlphacubeClient::updateMask()':
Alphacube.cpp:1339: error: 'setMask' was not declared in this scope
Alphacube.cpp: In member function 'virtual void Alphacube::AlphacubeClient::captionChange()':
Alphacube.cpp:1347: error: 'widget' was not declared in this scope
Alphacube.cpp:1347: error: 'isActive' was not declared in this scope
Alphacube.cpp: In member function 'void Alphacube::AlphacubeClient::iconChange()':
Alphacube.cpp:1393: error: 'widget' was not declared in this scope
Alphacube.cpp:1393: error: 'isActive' was not declared in this scope
Alphacube.cpp: In member function 'void Alphacube::AlphacubeClient::drawAppIcon(QPainter&)':
Alphacube.cpp:1407: error: 'isActive' was not declared in this scope
Alphacube.cpp:1409: error: 'class Alphacube::AlphacubeClient' has no member named 'icon'
Alphacube.cpp:1409: error: incomplete type 'QIconSet' used in nested name specifier
Alphacube.cpp:1409: error: incomplete type 'QIconSet' used in nested name specifier
Alphacube.cpp:1413: error: 'class Alphacube::AlphacubeClient' has no member named 'icon'
Alphacube.cpp:1413: error: incomplete type 'QIconSet' used in nested name specifier
Alphacube.cpp:1413: error: incomplete type 'QIconSet' used in nested name specifier
Alphacube.cpp:1448: error: 'isActive' was not declared in this scope
Alphacube.cpp: In member function 'void Alphacube::AlphacubeClient::drawCaptionText(QPainter&)':
Alphacube.cpp:1464: error: 'class Alphacube::AlphacubeHandler' has no member named 'options'
Alphacube.cpp:1464: error: 'isActive' was not declared in this scope
Alphacube.cpp:1468: error: 'AlignLeft' was not declared in this scope
Alphacube.cpp:1468: error: 'AlignVCenter' was not declared in this scope
Alphacube.cpp:1468: error: 'SingleLine' was not declared in this scope
Alphacube.cpp:1471: error: 'AlignCenter' was not declared in this scope
Alphacube.cpp:1474: error: 'AlignRight' was not declared in this scope
Alphacube.cpp:1518: error: 'caption' was not declared in this scope
Alphacube.cpp:1534: error: 'options' was not declared in this scope
Alphacube.cpp:1534: error: 'ColorFont' was not declared in this scope
Alphacube.cpp:1559: error: 'caption' was not declared in this scope
Alphacube.cpp: In member function 'void Alphacube::AlphacubeClient::drawTitlebar(QPainter&, QRect&)':
Alphacube.cpp:1573: error: 'isActive' was not declared in this scope
Alphacube.cpp:1602: error: 'isActive' was not declared in this scope
Alphacube.cpp: In member function 'void Alphacube::AlphacubeClient::drawFrame(QPainter&, QRect&, QPaintEvent*)':
Alphacube.cpp:1636: error: 'isActive' was not declared in this scope
Alphacube.cpp: In member function 'int Alphacube::AlphacubeClient::BttWidthOnLeft()':
Alphacube.cpp:1727: error: 'options' was not declared in this scope
Alphacube.cpp:1768: error: 'isMinimizable' was not declared in this scope
Alphacube.cpp:1770: error: 'isActive' was not declared in this scope
Alphacube.cpp:1772: error: 'isMaximizable' was not declared in this scope
Alphacube.cpp:1774: error: 'isActive' was not declared in this scope
Alphacube.cpp:1776: error: 'isCloseable' was not declared in this scope
Alphacube.cpp:1778: error: 'isActive' was not declared in this scope
Alphacube.cpp:1781: error: 'providesContextHelp' was not declared in this scope
Alphacube.cpp:1783: error: 'isActive' was not declared in this scope
Alphacube.cpp:1807: error: 'isActive' was not declared in this scope
Alphacube.cpp: In member function 'int Alphacube::AlphacubeClient::BttWidthOnRight()':
Alphacube.cpp:1815: error: 'options' was not declared in this scope
Alphacube.cpp:1856: error: 'isMinimizable' was not declared in this scope
Alphacube.cpp:1858: error: 'isActive' was not declared in this scope
Alphacube.cpp:1861: error: 'isMaximizable' was not declared in this scope
Alphacube.cpp:1863: error: 'isActive' was not declared in this scope
Alphacube.cpp:1866: error: 'isCloseable' was not declared in this scope
Alphacube.cpp:1868: error: 'isActive' was not declared in this scope
Alphacube.cpp:1871: error: 'providesContextHelp' was not declared in this scope
Alphacube.cpp:1873: error: 'isActive' was not declared in this scope
Alphacube.cpp:1903: error: 'isActive' was not declared in this scope
Alphacube.cpp: In member function 'virtual void Alphacube::AlphacubeClient::activeChange()':
Alphacube.cpp:1916: error: 'widget' was not declared in this scope
Alphacube.cpp: In member function 'virtual void Alphacube::AlphacubeClient::maximizeChange()':
Alphacube.cpp:1934: error: 'maximizeMode' was not declared in this scope
Alphacube.cpp:1934: error: 'MaximizeFull' was not declared in this scope
Alphacube.cpp:1937: error: 'widget' was not declared in this scope
Alphacube.cpp: In member function 'void Alphacube::AlphacubeClient::slotMaximize()':
Alphacube.cpp:1970: error: 'MidButton' was not declared in this scope
Alphacube.cpp:1971: error: 'maximizeMode' was not declared in this scope
Alphacube.cpp:1971: error: 'MaximizeVertical' was not declared in this scope
Alphacube.cpp:1971: error: 'maximize' was not declared in this scope
Alphacube.cpp:1974: error: 'RightButton' was not declared in this scope
Alphacube.cpp:1975: error: 'MaximizeHorizontal' was not declared in this scope
Alphacube.cpp:1978: error: 'LeftButton' was not declared in this scope
Alphacube.cpp:1979: error: 'MaximizeFull' was not declared in this scope
Alphacube.cpp:1979: error: 'MaximizeRestore' was not declared in this scope
Alphacube.cpp: In member function 'void Alphacube::AlphacubeClient::paintEvent(QPaintEvent*)':
Alphacube.cpp:2018: error: 'widget' was not declared in this scope
Alphacube.cpp: In member function 'void Alphacube::AlphacubeClient::resizeEvent(QResizeEvent*)':
Alphacube.cpp:2037: error: 'widget' was not declared in this scope
Alphacube.cpp:2062: error: no matching function for call to 'QApplication::postEvent(Alphacube::AlphacubeClient* const, QPaintEvent*)'
/usr/lib/qt3//include/qapplication.h:154: note: candidates are: static void QApplication::postEvent(QObject*, QEvent*)
Alphacube.cpp: In member function 'void Alphacube::AlphacubeClient::mouseDoubleClickEvent(QMouseEvent*)':
Alphacube.cpp:2070: error: 'titlebarDblClickOperation' was not declared in this scope
Alphacube.cpp: At global scope:
Alphacube.cpp:2074: error: 'Position' in class 'Alphacube::AlphacubeClient' does not name a type
Alphacube.cpp: In member function 'virtual void Alphacube::AlphacubeClient::resize(const QSize&)':
Alphacube.cpp:2151: error: 'widget' was not declared in this scope
Alphacube.cpp: In member function 'virtual void Alphacube::AlphacubeClient::borders(int&, int&, int&, int&) const':
Alphacube.cpp:2159: error: 'isActive' was not declared in this scope
Alphacube.cpp:2167: error: 'maximizeMode' was not declared in this scope
Alphacube.cpp:2167: error: 'MaximizeHorizontal' was not declared in this scope
Alphacube.cpp:2167: error: 'options' was not declared in this scope
Alphacube.cpp:2169: error: 'maximizeMode' was not declared in this scope
Alphacube.cpp:2169: error: 'MaximizeVertical' was not declared in this scope
Alphacube.cpp:2171: error: 'options' was not declared in this scope
Alphacube.cpp: In member function 'virtual QSize Alphacube::AlphacubeClient::minimumSize() const':
Alphacube.cpp:2178: error: 'widget' was not declared in this scope
Alphacube.cpp: In member function 'virtual bool Alphacube::AlphacubeClient::eventFilter(QObject*, QEvent*)':
Alphacube.cpp:2183: error: 'widget' was not declared in this scope
Alphacube.cpp:2200: error: 'processMousePressEvent' was not declared in this scope
Alphacube.cpp: At global scope:
Alphacube.cpp:2211: error: expected constructor, destructor, or type conversion before '*' token
make[3]: *** [Alphacube.lo] Error 1
make[3]: Leaving directory `/home/joshua/.themes/Alphacube-0.3/kwin'
make[2]: *** [all-recursive] Error 1
make[2]: Leaving directory `/home/joshua/.themes/Alphacube-0.3/kwin'
make[1]: *** [all-recursive] Error 1
make[1]: Leaving directory `/home/joshua/.themes/Alphacube-0.3'
make: *** [all] Error 2