rendered paste bodygobject-2.0.so /usr/lib/libgmodule-2.0.so /usr/lib/libgthread-2.0.so -lpthread /usr/lib/libglib-2.0.so /usr/lib/libstartup-notification-1.so /usr/lib/libSM.so /usr/lib/libICE.so /usr/lib/libX11.so /usr/lib/libXau.so /usr/lib/libXdmcp.so -ldl /usr/lib/libexif.so -lm /usr/lib/libpopt.so
/usr/lib/libcairo.so: undefined reference to `__popcountsi2@GCC_3.4'
/usr/lib/libcairo.so: undefined reference to `glitz_create_drawable'
/usr/lib/libcairo.so: undefined reference to `glitz_find_drawable_format'
collect2: ld returned 1 exit status
/usr/lib/libcairo.so: undefined reference to `__popcountsi2@GCC_3.4'
/usr/lib/libcairo.so: undefined reference to `glitz_create_drawable'
/usr/lib/libcairo.so: undefined reference to `glitz_find_drawable_format'
collect2: ld returned 1 exit status
make[4]: *** [nautilus] Error 1
make[4]: *** Waiting for unfinished jobs....
make[4]: *** [nautilus-file-management-properties] Error 1
make[4]: Leaving directory `/var/tmp/portage/nautilus-2.14.0/work/nautilus-2.14.0/src'
make[3]: *** [all-recursive] Error 1
make[3]: Leaving directory `/var/tmp/portage/nautilus-2.14.0/work/nautilus-2.14.0/src'
make[2]: *** [all] Error 2
make[2]: Leaving directory `/var/tmp/portage/nautilus-2.14.0/work/nautilus-2.14.0/src'
make[1]: *** [all-recursive] Error 1
make[1]: Leaving directory `/var/tmp/portage/nautilus-2.14.0/work/nautilus-2.14.0'
make: *** [all] Error 2
!!! ERROR: gnome-base/nautilus-2.14.0 failed.
Call stack:
ebuild.sh, line 1573: Called dyn_compile
ebuild.sh, line 982: Called src_compile
ebuild.sh, line 1288: Called gnome2_src_compile
!!! compile failure
!!! If you need support, post the topmost build error, and the call stack if relevant.