All pastes #466072 Raw Edit

Untitled

public text v1 · immutable
#466072 ·published 2007-04-30 20:01 UTC
rendered paste body
* Index libraries were found. strigidaemon will be built.
-- dbus support enabled
/usr/include/CLucene/store/Directory.h: In member function ‘virtual void lucene::store::Directory::deleteFile(const char*, bool)’:
/usr/include/CLucene/store/Directory.h:72: error: exception handling disabled, use -fexceptions to enable
/home/kde-devel/kde/src/strigi/src/luceneindexer/PrefixFilter.cpp: In copy constructor ‘lucene::search::StrigiPrefixFilter::StrigiPrefixFilter(const lucene::search::StrigiPrefixFilter&)’:
/home/kde-devel/kde/src/strigi/src/luceneindexer/PrefixFilter.cpp:29: warning: base class ‘class lucene::search::Filter’ should be explicitly initialized in the copy constructor
make[2]: *** [src/luceneindexer/CMakeFiles/cluceneindex.dir/PrefixFilter.o] Error 1
make[2]: *** Waiting for unfinished jobs....
/usr/include/CLucene/store/Directory.h: In member function ‘virtual void lucene::store::Directory::deleteFile(const char*, bool)’:
/usr/include/CLucene/store/Directory.h:72: error: exception handling disabled, use -fexceptions to enable
/home/kde-devel/kde/src/strigi/src/luceneindexer/../streamanalyzer/indexwriter.h: At global scope:
/home/kde-devel/kde/src/strigi/src/luceneindexer/../streamanalyzer/indexwriter.h:224: warning: unused parameter ‘fieldRegister’
/home/kde-devel/kde/src/strigi/src/luceneindexer/../streamanalyzer/indexwriter.h:247: warning: unused parameter ‘fieldRegister’
/home/kde-devel/kde/src/strigi/src/luceneindexer/../streamanalyzer/streamsaxanalyzer.h:92: warning: unused parameter ‘localname’
/home/kde-devel/kde/src/strigi/src/luceneindexer/../streamanalyzer/streamsaxanalyzer.h:92: warning: unused parameter ‘prefix’
/home/kde-devel/kde/src/strigi/src/luceneindexer/../streamanalyzer/streamsaxanalyzer.h:92: warning: unused parameter ‘uri’
/home/kde-devel/kde/src/strigi/src/luceneindexer/../streamanalyzer/streamsaxanalyzer.h:92: warning: unused parameter ‘nb_namespaces’
/home/kde-devel/kde/src/strigi/src/luceneindexer/../streamanalyzer/streamsaxanalyzer.h:92: warning: unused parameter ‘namespaces’
/home/kde-devel/kde/src/strigi/src/luceneindexer/../streamanalyzer/streamsaxanalyzer.h:92: warning: unused parameter ‘nb_attributes’
/home/kde-devel/kde/src/strigi/src/luceneindexer/../streamanalyzer/streamsaxanalyzer.h:92: warning: unused parameter ‘nb_defaulted’
/home/kde-devel/kde/src/strigi/src/luceneindexer/../streamanalyzer/streamsaxanalyzer.h:92: warning: unused parameter ‘attributes’
/home/kde-devel/kde/src/strigi/src/luceneindexer/../streamanalyzer/streamsaxanalyzer.h:107: warning: unused parameter ‘localname’
/home/kde-devel/kde/src/strigi/src/luceneindexer/../streamanalyzer/streamsaxanalyzer.h:107: warning: unused parameter ‘prefix’
/home/kde-devel/kde/src/strigi/src/luceneindexer/../streamanalyzer/streamsaxanalyzer.h:107: warning: unused parameter ‘uri’
/home/kde-devel/kde/src/strigi/src/luceneindexer/../streamanalyzer/streamsaxanalyzer.h:114: warning: unused parameter ‘data’
/home/kde-devel/kde/src/strigi/src/luceneindexer/../streamanalyzer/streamsaxanalyzer.h:114: warning: unused parameter ‘length’
/home/kde-devel/kde/src/strigi/src/luceneindexer/cluceneindexwriter.h:49: warning: unused parameter ‘fieldname’
/home/kde-devel/kde/src/strigi/src/luceneindexer/cluceneindexwriter.h:49: warning: unused parameter ‘data’
/home/kde-devel/kde/src/strigi/src/luceneindexer/cluceneindexwriter.h:49: warning: unused parameter ‘size’
/home/kde-devel/kde/src/strigi/src/luceneindexer/cluceneindexwriter.h:51: warning: unused parameter ‘fieldname’
/home/kde-devel/kde/src/strigi/src/luceneindexer/cluceneindexwriter.h:51: warning: unused parameter ‘value’
/home/kde-devel/kde/src/strigi/src/luceneindexer/cluceneindexwriter.h:53: warning: unused parameter ‘fieldname’
/home/kde-devel/kde/src/strigi/src/luceneindexer/cluceneindexwriter.h:53: warning: unused parameter ‘value’
/home/kde-devel/kde/src/strigi/src/luceneindexer/cluceneindexwriter.h:55: warning: unused parameter ‘fieldname’
/home/kde-devel/kde/src/strigi/src/luceneindexer/cluceneindexwriter.h:55: warning: unused parameter ‘value’
/home/kde-devel/kde/src/strigi/src/luceneindexer/cluceneindexwriter.h:57: warning: unused parameter ‘subject’
/home/kde-devel/kde/src/strigi/src/luceneindexer/cluceneindexwriter.h:57: warning: unused parameter ‘predicate’
/home/kde-devel/kde/src/strigi/src/luceneindexer/cluceneindexwriter.h:57: warning: unused parameter ‘object’
/home/kde-devel/kde/src/strigi/src/luceneindexer/cluceneindexwriter.h:60: warning: unused parameter ‘field’
/home/kde-devel/kde/src/strigi/src/luceneindexer/cluceneindexwriter.h:60: warning: unused parameter ‘name’
/home/kde-devel/kde/src/strigi/src/luceneindexer/cluceneindexwriter.h:60: warning: unused parameter ‘value’
/home/kde-devel/kde/src/strigi/src/luceneindexer/cluceneindexmanager.cpp: In member function ‘void CLuceneIndexManager::openWriter(bool)’:
/home/kde-devel/kde/src/strigi/src/luceneindexer/cluceneindexmanager.cpp:126: error: ‘err’ was not declared in this scope
make[2]: *** [src/luceneindexer/CMakeFiles/cluceneindex.dir/cluceneindexmanager.o] Error 1
/usr/include/CLucene/store/Directory.h: In member function ‘virtual void lucene::store::Directory::deleteFile(const char*, bool)’:
/usr/include/CLucene/store/Directory.h:72: error: exception handling disabled, use -fexceptions to enable
/usr/include/CLucene/store/Directory.h: In member function ‘virtual void lucene::store::Directory::deleteFile(const char*, bool)’:
/usr/include/CLucene/store/Directory.h:72: error: exception handling disabled, use -fexceptions to enable
/home/kde-devel/kde/src/strigi/src/luceneindexer/../streamanalyzer/indexwriter.h: At global scope:
/home/kde-devel/kde/src/strigi/src/luceneindexer/../streamanalyzer/indexwriter.h:224: warning: unused parameter ‘fieldRegister’
/home/kde-devel/kde/src/strigi/src/luceneindexer/../streamanalyzer/indexwriter.h:247: warning: unused parameter ‘fieldRegister’
/home/kde-devel/kde/src/strigi/src/luceneindexer/../streamanalyzer/streamsaxanalyzer.h:92: warning: unused parameter ‘localname’
/home/kde-devel/kde/src/strigi/src/luceneindexer/../streamanalyzer/streamsaxanalyzer.h:92: warning: unused parameter ‘prefix’
/home/kde-devel/kde/src/strigi/src/luceneindexer/../streamanalyzer/streamsaxanalyzer.h:92: warning: unused parameter ‘uri’
/home/kde-devel/kde/src/strigi/src/luceneindexer/../streamanalyzer/streamsaxanalyzer.h:92: warning: unused parameter ‘nb_namespaces’
/home/kde-devel/kde/src/strigi/src/luceneindexer/../streamanalyzer/streamsaxanalyzer.h:92: warning: unused parameter ‘namespaces’
/home/kde-devel/kde/src/strigi/src/luceneindexer/../streamanalyzer/streamsaxanalyzer.h:92: warning: unused parameter ‘nb_attributes’
/home/kde-devel/kde/src/strigi/src/luceneindexer/../streamanalyzer/streamsaxanalyzer.h:92: warning: unused parameter ‘nb_defaulted’
/home/kde-devel/kde/src/strigi/src/luceneindexer/../streamanalyzer/streamsaxanalyzer.h:92: warning: unused parameter ‘attributes’
/home/kde-devel/kde/src/strigi/src/luceneindexer/../streamanalyzer/streamsaxanalyzer.h:107: warning: unused parameter ‘localname’
/home/kde-devel/kde/src/strigi/src/luceneindexer/../streamanalyzer/streamsaxanalyzer.h:107: warning: unused parameter ‘prefix’
/home/kde-devel/kde/src/strigi/src/luceneindexer/../streamanalyzer/streamsaxanalyzer.h:107: warning: unused parameter ‘uri’
/home/kde-devel/kde/src/strigi/src/luceneindexer/../streamanalyzer/streamsaxanalyzer.h:114: warning: unused parameter ‘data’
/home/kde-devel/kde/src/strigi/src/luceneindexer/../streamanalyzer/streamsaxanalyzer.h:114: warning: unused parameter ‘length’
/home/kde-devel/kde/src/strigi/src/luceneindexer/cluceneindexwriter.h:49: warning: unused parameter ‘fieldname’
/home/kde-devel/kde/src/strigi/src/luceneindexer/cluceneindexwriter.h:49: warning: unused parameter ‘data’
/home/kde-devel/kde/src/strigi/src/luceneindexer/cluceneindexwriter.h:49: warning: unused parameter ‘size’
/home/kde-devel/kde/src/strigi/src/luceneindexer/cluceneindexwriter.h:51: warning: unused parameter ‘fieldname’
/home/kde-devel/kde/src/strigi/src/luceneindexer/cluceneindexwriter.h:51: warning: unused parameter ‘value’
/home/kde-devel/kde/src/strigi/src/luceneindexer/cluceneindexwriter.h:53: warning: unused parameter ‘fieldname’
/home/kde-devel/kde/src/strigi/src/luceneindexer/cluceneindexwriter.h:53: warning: unused parameter ‘value’
/home/kde-devel/kde/src/strigi/src/luceneindexer/cluceneindexwriter.h:55: warning: unused parameter ‘fieldname’
/home/kde-devel/kde/src/strigi/src/luceneindexer/cluceneindexwriter.h:55: warning: unused parameter ‘value’
/home/kde-devel/kde/src/strigi/src/luceneindexer/cluceneindexwriter.h:57: warning: unused parameter ‘subject’
/home/kde-devel/kde/src/strigi/src/luceneindexer/cluceneindexwriter.h:57: warning: unused parameter ‘predicate’
/home/kde-devel/kde/src/strigi/src/luceneindexer/cluceneindexwriter.h:57: warning: unused parameter ‘object’
/home/kde-devel/kde/src/strigi/src/luceneindexer/cluceneindexwriter.h:60: warning: unused parameter ‘field’
/home/kde-devel/kde/src/strigi/src/luceneindexer/cluceneindexwriter.h:60: warning: unused parameter ‘name’
/home/kde-devel/kde/src/strigi/src/luceneindexer/cluceneindexwriter.h:60: warning: unused parameter ‘value’
/home/kde-devel/kde/src/strigi/src/luceneindexer/cluceneindexwriter.cpp: In member function ‘virtual void CLuceneIndexWriter::finishAnalysis(const Strigi::AnalysisResult*)’:
/home/kde-devel/kde/src/strigi/src/luceneindexer/cluceneindexwriter.cpp:192: error: ‘err’ was not declared in this scope
/home/kde-devel/kde/src/strigi/src/luceneindexer/cluceneindexwriter.cpp: In member function ‘void CLuceneIndexWriter::deleteEntry(const std::string&)’:
/home/kde-devel/kde/src/strigi/src/luceneindexer/cluceneindexwriter.cpp:221: error: ‘err’ was not declared in this scope
/home/kde-devel/kde/src/strigi/src/luceneindexer/cluceneindexwriter.cpp:232: error: ‘err’ was not declared in this scope
make[2]: *** [src/luceneindexer/CMakeFiles/cluceneindex.dir/cluceneindexwriter.o] Error 1
/home/kde-devel/kde/src/strigi/src/luceneindexer/cluceneindexreader.cpp: At global scope:
/home/kde-devel/kde/src/strigi/src/luceneindexer/cluceneindexreader.cpp:56: warning: unused parameter ‘doc’
/home/kde-devel/kde/src/strigi/src/luceneindexer/cluceneindexreader.cpp:56: warning: unused parameter ‘score’
/home/kde-devel/kde/src/strigi/src/luceneindexer/cluceneindexreader.cpp: In member function ‘void CLuceneIndexReader::openReader()’:
/home/kde-devel/kde/src/strigi/src/luceneindexer/cluceneindexreader.cpp:87: error: ‘err’ was not declared in this scope
/home/kde-devel/kde/src/strigi/src/luceneindexer/cluceneindexreader.cpp: In member function ‘void CLuceneIndexReader::closeReader()’:
/home/kde-devel/kde/src/strigi/src/luceneindexer/cluceneindexreader.cpp:97: error: ‘err’ was not declared in this scope
/home/kde-devel/kde/src/strigi/src/luceneindexer/cluceneindexreader.cpp: In member function ‘virtual int32_t CLuceneIndexReader::countHits(const Strigi::Query&)’:
/home/kde-devel/kde/src/strigi/src/luceneindexer/cluceneindexreader.cpp:278: error: ‘err’ was not declared in this scope
/home/kde-devel/kde/src/strigi/src/luceneindexer/cluceneindexreader.cpp: In member function &#8216;virtual std::vector<Strigi::IndexedDocument, std::allocator<Strigi::IndexedDocument> > CLuceneIndexReader::query(const Strigi::Query&)&#8217;:
/home/kde-devel/kde/src/strigi/src/luceneindexer/cluceneindexreader.cpp:301: error: &#8216;err&#8217; was not declared in this scope
/home/kde-devel/kde/src/strigi/src/luceneindexer/cluceneindexreader.cpp: At global scope:
/home/kde-devel/kde/src/strigi/src/luceneindexer/cluceneindexreader.cpp:455: warning: unused parameter &#8216;min&#8217;
/home/kde-devel/kde/src/strigi/src/luceneindexer/cluceneindexreader.cpp:455: warning: unused parameter &#8216;max&#8217;
/home/kde-devel/kde/src/strigi/src/luceneindexer/cluceneindexreader.cpp: In member function &#8216;virtual std::vector<std::pair<std::basic_string<char, std::char_traits<char>, std::allocator<char> >, unsigned int>, std::allocator<std::pair<std::basic_string<char, std::char_traits<char>, std::allocator<char> >, unsigned int> > > CLuceneIndexReader::histogram(const std::string&, const std::string&, const std::string&)&#8217;:
/home/kde-devel/kde/src/strigi/src/luceneindexer/cluceneindexreader.cpp:489: error: &#8216;err&#8217; was not declared in this scope
/home/kde-devel/kde/src/strigi/src/luceneindexer/cluceneindexreader.cpp: At global scope:
/home/kde-devel/kde/src/strigi/src/luceneindexer/cluceneindexreader.cpp:543: warning: unused parameter &#8216;keywordprefix&#8217;
/home/kde-devel/kde/src/strigi/src/luceneindexer/cluceneindexreader.cpp:543: warning: unused parameter &#8216;fieldnames&#8217;
/home/kde-devel/kde/src/strigi/src/luceneindexer/cluceneindexreader.cpp:548: warning: unused parameter &#8216;offset&#8217;
make[2]: *** [src/luceneindexer/CMakeFiles/cluceneindex.dir/cluceneindexreader.o] Error 1
make[1]: *** [src/luceneindexer/CMakeFiles/cluceneindex.dir/all] Error 2
make: *** [all] Error 2