All pastes #465758 Raw Edit

Stuff

public text v1 · immutable
#465758 ·published 2007-04-30 15:42 UTC
rendered paste body
Making all in 3D
make[2]: Entering directory `/home1/hvh/BZFLAG/bzflag_svn_cs_branch/bzflag/src/3D'
if /bin/sh ../../libtool --tag=CXX --mode=compile g++ -DHAVE_CONFIG_H -I. -I. -I../../include  -I../../include -Wall -W -Werror -Wshadow -I/usr/local/include/crystalspace -g -O2 -O0 -Wno-deprecated -fsigned-char -pg -MT BitmapFont.lo -MD -MP -MF ".deps/BitmapFont.Tpo" -c -o BitmapFont.lo BitmapFont.cxx; \
        then mv -f ".deps/BitmapFont.Tpo" ".deps/BitmapFont.Plo"; else rm -f ".deps/BitmapFont.Tpo"; exit 1; fi
 g++ -DHAVE_CONFIG_H -I. -I. -I../../include -I../../include -Wall -W -Werror -Wshadow -I/usr/local/include/crystalspace -g -O2 -O0 -Wno-deprecated -fsigned-char -pg -MT BitmapFont.lo -MD -MP -MF .deps/BitmapFont.Tpo -c BitmapFont.cxx -o BitmapFont.o
cc1plus: warnings being treated as errors
/usr/local/include/crystalspace/csutil/algorithms.h: In constructor 'CS::ConditionAnd<T1, T2>::ConditionAnd(T1, T2)':
/usr/local/include/crystalspace/csutil/algorithms.h:95: warning: declaration of 'op2' shadows a member of 'this'
/usr/local/include/crystalspace/csutil/algorithms.h:95: warning: declaration of 'op1' shadows a member of 'this'
/usr/local/include/crystalspace/csgeom/vector2.h: In constructor 'csVector2::csVector2(float, float)':
/usr/local/include/crystalspace/csgeom/vector2.h:55: warning: declaration of 'y' shadows a member of 'this'
/usr/local/include/crystalspace/csgeom/vector2.h:55: warning: declaration of 'x' shadows a member of 'this'
/usr/local/include/crystalspace/csgeom/math3d_d.h: In member function 'void csDMatrix3::Set(double, double, double, double, double, double, double, double, double)':
/usr/local/include/crystalspace/csgeom/math3d_d.h:261: warning: declaration of 'm33' shadows a member of 'this'
/usr/local/include/crystalspace/csgeom/math3d_d.h:261: warning: declaration of 'm32' shadows a member of 'this'
/usr/local/include/crystalspace/csgeom/math3d_d.h:261: warning: declaration of 'm31' shadows a member of 'this'
/usr/local/include/crystalspace/csgeom/math3d_d.h:261: warning: declaration of 'm23' shadows a member of 'this'
/usr/local/include/crystalspace/csgeom/math3d_d.h:261: warning: declaration of 'm22' shadows a member of 'this'
/usr/local/include/crystalspace/csgeom/math3d_d.h:261: warning: declaration of 'm21' shadows a member of 'this'
/usr/local/include/crystalspace/csgeom/math3d_d.h:261: warning: declaration of 'm13' shadows a member of 'this'
/usr/local/include/crystalspace/csgeom/math3d_d.h:261: warning: declaration of 'm12' shadows a member of 'this'
/usr/local/include/crystalspace/csgeom/math3d_d.h:261: warning: declaration of 'm11' shadows a member of 'this'
/usr/local/include/crystalspace/csgeom/vector3.h: In constructor 'csVector3::csVector3(float)':
/usr/local/include/crystalspace/csgeom/vector3.h:91: warning: declaration of 'm' shadows a member of 'this'
/usr/local/include/crystalspace/csutil/allocator.h: In constructor 'CS::Memory::AllocatorPointerWrapper<T, Allocator>::AllocatorPointerWrapper(T*)':
/usr/local/include/crystalspace/csutil/allocator.h:245: warning: declaration of 'p' shadows a member of 'this'
/usr/local/include/crystalspace/csutil/allocator.h: In constructor 'CS::Memory::AllocatorPointerWrapper<T, Allocator>::AllocatorPointerWrapper(const Allocator&, T*)':
/usr/local/include/crystalspace/csutil/allocator.h:246: warning: declaration of 'p' shadows a member of 'this'
/usr/local/include/crystalspace/csutil/array.h: In constructor 'csArrayCapacityDefault::csArrayCapacityDefault(const csArrayThresholdVariable&)':
/usr/local/include/crystalspace/csutil/array.h:326: warning: declaration of 'threshold' shadows a member of 'this'
/usr/local/include/crystalspace/csutil/array.h: In member function 'void csArray<T, ElementHandler, MemoryAllocator, CapacityHandler>::InitRegion(size_t, size_t)':
/usr/local/include/crystalspace/csutil/array.h:387: warning: declaration of 'count' shadows a member of 'this'
/usr/local/include/crystalspace/csutil/hash.h: In constructor 'csPtrKey<T>::csPtrKey(T*)':
/usr/local/include/crystalspace/csutil/hash.h:152: warning: declaration of 'ptr' shadows a member of 'this'
/usr/local/include/crystalspace/csutil/csstring.h: In constructor 'csStringBase::csStringBase(size_t)':
/usr/local/include/crystalspace/csutil/csstring.h:201: warning: declaration of 'Length' shadows a member of 'this'
/usr/local/include/crystalspace/csutil/csstring.h: In constructor 'csStringFast<LEN>::csStringFast(size_t)':
/usr/local/include/crystalspace/csutil/csstring.h:1011: warning: declaration of 'Length' shadows a member of 'this'
/usr/local/include/crystalspace/csutil/csstring.h: In constructor 'csStringFast<0>::csStringFast(size_t)':
/usr/local/include/crystalspace/csutil/csstring.h:1105: warning: declaration of 'Length' shadows a member of 'this'
/usr/local/include/crystalspace/csutil/csstring.h: In constructor 'csString::csString(size_t)':
/usr/local/include/crystalspace/csutil/csstring.h:1170: warning: declaration of 'Length' shadows a member of 'this'
/usr/local/include/crystalspace/csgeom/kdtree.h: In member function 'void csKDTree::SetObjectDescriptor(iKDTreeObjectDescriptor*)':
/usr/local/include/crystalspace/csgeom/kdtree.h:284: warning: declaration of 'descriptor' shadows a member of 'this'
/usr/local/include/crystalspace/csgeom/matrix2.h: In member function 'void csMatrix2::Set(float, float, float, float)':
/usr/local/include/crystalspace/csgeom/matrix2.h:66: warning: declaration of 'm22' shadows a member of 'this'
/usr/local/include/crystalspace/csgeom/matrix2.h:66: warning: declaration of 'm21' shadows a member of 'this'
/usr/local/include/crystalspace/csgeom/matrix2.h:66: warning: declaration of 'm12' shadows a member of 'this'
/usr/local/include/crystalspace/csgeom/matrix2.h:66: warning: declaration of 'm11' shadows a member of 'this'
/usr/local/include/crystalspace/csgeom/spline.h: In member function 'float csSpline::GetTimeValue(int) const':
/usr/local/include/crystalspace/csgeom/spline.h:90: warning: declaration of 'idx' shadows a member of 'this'
/usr/local/include/crystalspace/csgeom/spline.h: In member function 'float csSpline::GetDimensionValue(int, int) const':
/usr/local/include/crystalspace/csgeom/spline.h:115: warning: declaration of 'idx' shadows a member of 'this'
/usr/local/include/crystalspace/csgeom/polymesh.h: In member function 'void csPolygonMesh::SetVertices(csVector3*, int, bool)':
/usr/local/include/crystalspace/csgeom/polymesh.h:106: warning: declaration of 'delete_vt' shadows a member of 'this'
/usr/local/include/crystalspace/csgeom/polymesh.h:106: warning: declaration of 'vt_count' shadows a member of 'this'
/usr/local/include/crystalspace/csgeom/polymesh.h:106: warning: declaration of 'vt' shadows a member of 'this'
/usr/local/include/crystalspace/csgeom/polymesh.h: In member function 'void csPolygonMesh::SetPolygons(csMeshedPolygon*, int, bool)':
/usr/local/include/crystalspace/csgeom/polymesh.h:120: warning: declaration of 'delete_po' shadows a member of 'this'
/usr/local/include/crystalspace/csgeom/polymesh.h:120: warning: declaration of 'po_count' shadows a member of 'this'
/usr/local/include/crystalspace/csgeom/polymesh.h:120: warning: declaration of 'po' shadows a member of 'this'
/usr/local/include/crystalspace/csgeom/polymesh.h: In member function 'void csPolygonMesh::SetPolygonIndices(int*, bool)':
/usr/local/include/crystalspace/csgeom/polymesh.h:131: warning: declaration of 'delete_po_indices' shadows a member of 'this'
/usr/local/include/crystalspace/csgeom/polymesh.h:131: warning: declaration of 'po_indices' shadows a member of 'this'
/usr/local/include/crystalspace/csgeom/polymesh.h: In member function 'void csPolygonMesh::SetVertexCount(int)':
/usr/local/include/crystalspace/csgeom/polymesh.h:161: warning: declaration of 'vt_count' shadows a member of 'this'
/usr/local/include/crystalspace/csgeom/polymesh.h: In member function 'void csPolygonMesh::SetPolygonCount(int)':
/usr/local/include/crystalspace/csgeom/polymesh.h:174: warning: declaration of 'po_count' shadows a member of 'this'
/usr/local/include/crystalspace/csgeom/quaternion.h: In constructor 'csQuaternion::csQuaternion(float, float, float, float)':
/usr/local/include/crystalspace/csgeom/quaternion.h:53: warning: declaration of 'w' shadows a member of 'this'
/usr/local/include/crystalspace/csgeom/quaternion.h: In constructor 'csQuaternion::csQuaternion(const csVector3&, float)':
/usr/local/include/crystalspace/csgeom/quaternion.h:58: warning: declaration of 'w' shadows a member of 'this'
/usr/local/include/crystalspace/csgeom/quaternion.h:58: warning: declaration of 'v' shadows a member of 'this'
/usr/local/include/crystalspace/csgeom/sphere.h: In constructor 'csSphere::csSphere(const csVector3&, float)':
/usr/local/include/crystalspace/csgeom/sphere.h:55: warning: declaration of 'radius' shadows a member of 'this'
/usr/local/include/crystalspace/csgeom/sphere.h:55: warning: declaration of 'center' shadows a member of 'this'
/usr/local/include/crystalspace/csgeom/sphere.h: In constructor 'csEllipsoid::csEllipsoid(const csVector3&, const csVector3&)':
/usr/local/include/crystalspace/csgeom/sphere.h:106: warning: declaration of 'radius' shadows a member of 'this'
/usr/local/include/crystalspace/csgeom/sphere.h:106: warning: declaration of 'center' shadows a member of 'this'
/usr/local/include/crystalspace/csgeom/vector4.h: In constructor 'csVector4T<T>::csVector4T(const T&)':
/usr/local/include/crystalspace/csgeom/vector4.h:80: warning: declaration of 'm' shadows a member of 'this'
/usr/local/include/crystalspace/csgeom/vector4.h: In constructor 'csVector4::csVector4(const float&)':
/usr/local/include/crystalspace/csgeom/vector4.h:319: warning: declaration of 'm' shadows a member of 'this'
/usr/local/include/crystalspace/csutil/scfarray.h: In constructor 'scfArray<IF, Backend>::scfArray(const Backend&)':
/usr/local/include/crystalspace/csutil/scfarray.h:74: warning: declaration of 'storage' shadows a member of 'this'
/usr/local/include/crystalspace/csutil/scfarray.h: In constructor 'scfArray<IF, Backend>::scfArray(const Backend&, iBase*)':
/usr/local/include/crystalspace/csutil/scfarray.h:76: warning: declaration of 'storage' shadows a member of 'this'
/usr/local/include/crystalspace/csutil/scfarray.h: In constructor 'scfArrayWrap<IF, Backend>::scfArrayWrap(Backend&)':
/usr/local/include/crystalspace/csutil/scfarray.h:166: warning: declaration of 'storage' shadows a member of 'this'
/usr/local/include/crystalspace/csutil/scfarray.h: In constructor 'scfArrayWrap<IF, Backend>::scfArrayWrap(Backend&, iBase*)':
/usr/local/include/crystalspace/csutil/scfarray.h:168: warning: declaration of 'storage' shadows a member of 'this'
/usr/local/include/crystalspace/csutil/scfarray.h: In constructor 'scfArrayWrapConst<IF, Backend>::scfArrayWrapConst(const Backend&)':
/usr/local/include/crystalspace/csutil/scfarray.h:257: warning: declaration of 'storage' shadows a member of 'this'
/usr/local/include/crystalspace/csutil/scfarray.h: In constructor 'scfArrayWrapConst<IF, Backend>::scfArrayWrapConst(const Backend&, iBase*)':
/usr/local/include/crystalspace/csutil/scfarray.h:259: warning: declaration of 'storage' shadows a member of 'this'
/usr/local/include/crystalspace/csgfx/shadervar.h: In constructor 'CS::ShaderVarName::ShaderVarName(iStringSet*, const char*)':
/usr/local/include/crystalspace/csgfx/shadervar.h:469: warning: declaration of 'name' shadows a member of 'this'
/usr/local/include/crystalspace/csgfx/trianglestream.h: In member function 'void CS::TriangleIndicesStream<T>::BeginTriangulate(const uint8*, const uint8*, size_t, csRenderBufferComponentType, csRenderMeshType)':
/usr/local/include/crystalspace/csgfx/trianglestream.h:125: warning: declaration of 'meshtype' shadows a member of 'this'
/usr/local/include/crystalspace/csgfx/trianglestream.h:125: warning: declaration of 'compType' shadows a member of 'this'
/usr/local/include/crystalspace/csgfx/trianglestream.h:125: warning: declaration of 'stride' shadows a member of 'this'
/usr/local/include/crystalspace/csgfx/trianglestream.h:125: warning: declaration of 'indexEnd' shadows a member of 'this'
/usr/local/include/crystalspace/csgfx/trianglestream.h:125: warning: declaration of 'index' shadows a member of 'this'
/usr/local/include/crystalspace/csgfx/vertexlistwalker.h: In constructor 'csVertexListWalker<Tbase, Tcomplex>::csVertexListWalker(iRenderBuffer*, size_t, const Tbase*)':
/usr/local/include/crystalspace/csgfx/vertexlistwalker.h:56: warning: declaration of 'defaultComponents' shadows a member of 'this'
/usr/local/include/crystalspace/csgfx/vertexlight.h: In constructor 'csPointLightProc<AttenuationProc>::csPointLightProc(const csLightProperties&, float)':
/usr/local/include/crystalspace/csgfx/vertexlight.h:226: warning: declaration of 'blackLimit' shadows a member of 'this'
/usr/local/include/crystalspace/csgfx/vertexlight.h: In constructor 'csDirectionalLightProc<AttenuationProc>::csDirectionalLightProc(const csLightProperties&, float)':
/usr/local/include/crystalspace/csgfx/vertexlight.h:274: warning: declaration of 'blackLimit' shadows a member of 'this'
/usr/local/include/crystalspace/csgfx/vertexlight.h: In constructor 'csDirectionalLightProc<AttenuationProc>::PerVertex::PerVertex(const csDirectionalLightProc<AttenuationProc>&, const csVector3&, const csVector3&)':
/usr/local/include/crystalspace/csgfx/vertexlight.h:296: warning: declaration of 'direction' shadows a member of 'this'
/usr/local/include/crystalspace/csgfx/vertexlight.h: In constructor 'csSpotLightProc<AttenuationProc>::csSpotLightProc(const csLightProperties&, float)':
/usr/local/include/crystalspace/csgfx/vertexlight.h:326: warning: declaration of 'blackLimit' shadows a member of 'this'
/usr/local/include/crystalspace/csplugincommon/canvas/draw_common.h: In constructor 'csPixMixerCopy<Tpixel>::csPixMixerCopy(csGraphics2D*, Tpixel, uint8)':
/usr/local/include/crystalspace/csplugincommon/canvas/draw_common.h:48: warning: declaration of 'color' shadows a member of 'this'
/usr/local/include/crystalspace/csplugincommon/canvas/softfontcacheimpl.h: In constructor 'csSoftFontCacheImpl<Tpixel, Tpixmixer>::csSoftFontCacheImpl(csGraphics2D*)':
/usr/local/include/crystalspace/csplugincommon/canvas/softfontcacheimpl.h:115: warning: declaration of 'G2D' shadows a member of 'this'
/usr/local/include/crystalspace/csutil/floatrand.h: In constructor 'csRandomFloatGen::csRandomFloatGen(unsigned int)':
/usr/local/include/crystalspace/csutil/floatrand.h:45: warning: declaration of 'seed' shadows a member of 'this'
/usr/local/include/crystalspace/csplugincommon/particlesys/partgen.h: In member function 'virtual void csParticleSystem::GetObjectBoundingBox(csBox3&)':
/usr/local/include/crystalspace/csplugincommon/particlesys/partgen.h:289: warning: declaration of 'bbox' shadows a member of 'this'
/usr/local/include/crystalspace/csplugincommon/particlesys/partgen.h: In member function 'virtual void csParticleSystem::SetObjectBoundingBox(const csBox3&)':
/usr/local/include/crystalspace/csplugincommon/particlesys/partgen.h:299: warning: declaration of 'bbox' shadows a member of 'this'
/usr/local/include/crystalspace/csplugincommon/particlesys/partgen.h: In member function 'virtual bool csParticleSystem::SetMaterialWrapper(iMaterialWrapper*)':
/usr/local/include/crystalspace/csplugincommon/particlesys/partgen.h:368: warning: declaration of 'mat' shadows a member of 'this'
/usr/local/include/crystalspace/csplugincommon/render3d/txtmgr.h: In member function 'virtual void csTextureHandle::SetAlphaType(csAlphaMode::AlphaType)':
/usr/local/include/crystalspace/csplugincommon/render3d/txtmgr.h:133: warning: declaration of 'alphaType' shadows a member of 'this'
/usr/local/include/crystalspace/cstool/collider.h: In member function 'void csColliderActor::SetCollideSystem(iCollideSystem*)':
/usr/local/include/crystalspace/cstool/collider.h:410: warning: declaration of 'cdsys' shadows a member of 'this'
/usr/local/include/crystalspace/cstool/collider.h: In member function 'void csColliderActor::SetEngine(iEngine*)':
/usr/local/include/crystalspace/cstool/collider.h:416: warning: declaration of 'engine' shadows a member of 'this'
/usr/local/include/crystalspace/cstool/csapplicationframework.h: In static member function 'static bool csApplicationFramework::SetupConfigManager(iObjectRegistry*, const char*)':
/usr/local/include/crystalspace/cstool/csapplicationframework.h:265: warning: declaration of 'object_reg' shadows a previous local
/usr/local/include/crystalspace/cstool/csapplicationframework.h:207: warning: shadowed declaration is here
/usr/local/include/crystalspace/cstool/debugimagewriter.h: At global scope:
/usr/local/include/crystalspace/cstool/debugimagewriter.h:41: warning: unused parameter 'severity'
/usr/local/include/crystalspace/cstool/debugimagewriter.h:41: warning: unused parameter 'msg'
/usr/local/include/crystalspace/cstool/identstrings.h: In constructor 'csIdentStrings::csIdentStrings(const csIdentStrings::csIdentString*, csString*, size_t)':
/usr/local/include/crystalspace/cstool/identstrings.h:45: warning: declaration of 'scratch' shadows a member of 'this'
/usr/local/include/crystalspace/cstool/rendermeshlist.h: In constructor 'csRenderMeshList::meshListEntry::meshListEntry(csRenderMesh*, iMeshWrapper*)':
/usr/local/include/crystalspace/cstool/rendermeshlist.h:89: warning: declaration of 'mesh' shadows a member of 'this'
/usr/local/include/crystalspace/cstool/userrndbuf.h: In constructor 'csUserRenderBufferManager::UserBufArrayCmp::UserBufArrayCmp(csStringID)':
/usr/local/include/crystalspace/cstool/userrndbuf.h:65: warning: declaration of 'key' shadows a member of 'this'
/usr/local/include/crystalspace/cstool/vfsdirchange.h: In constructor 'csVfsDirectoryChanger::csVfsDirectoryChanger(iVFS*)':
/usr/local/include/crystalspace/cstool/vfsdirchange.h:41: warning: declaration of 'vfs' shadows a member of 'this'
/usr/local/include/crystalspace/csutil/eventhandlers.h: In constructor 'csEventHandlerRegistry::KnownEventHandler::KnownEventHandler(iEventHandler*)':
/usr/local/include/crystalspace/csutil/eventhandlers.h:197: warning: declaration of 'handler' shadows a member of 'this'
/usr/local/include/crystalspace/csutil/cseventq.h: In constructor 'csEventQueue::PreProcessFrameEventDispatcher::PreProcessFrameEventDispatcher(csEventQueue*)':
/usr/local/include/crystalspace/csutil/cseventq.h:274: warning: declaration of 'parent' shadows a member of 'this'
/usr/local/include/crystalspace/csutil/cseventq.h: In constructor 'csEventQueue::ProcessFrameEventDispatcher::ProcessFrameEventDispatcher(csEventQueue*)':
/usr/local/include/crystalspace/csutil/cseventq.h:289: warning: declaration of 'parent' shadows a member of 'this'
/usr/local/include/crystalspace/csutil/cseventq.h: In constructor 'csEventQueue::PostProcessFrameEventDispatcher::PostProcessFrameEventDispatcher(csEventQueue*)':
/usr/local/include/crystalspace/csutil/cseventq.h:304: warning: declaration of 'parent' shadows a member of 'this'
/usr/local/include/crystalspace/csutil/cseventq.h: In constructor 'csEventQueue::FinalProcessFrameEventDispatcher::FinalProcessFrameEventDispatcher(csEventQueue*)':
/usr/local/include/crystalspace/csutil/cseventq.h:319: warning: declaration of 'parent' shadows a member of 'this'
/usr/local/include/crystalspace/csutil/syspath.h: In constructor 'csPathsList::Entry::Entry(const char*, const char*, bool)':
/usr/local/include/crystalspace/csutil/syspath.h:83: warning: declaration of 'type' shadows a member of 'this'
/usr/local/include/crystalspace/csutil/syspath.h:83: warning: declaration of 'path' shadows a member of 'this'
/usr/local/include/crystalspace/csutil/documenthelper.h: In constructor 'CS::DocumentHelper::Implementation::FilterDocumentNodeIterator<T>::FilterDocumentNodeIterator(csRef<iDocumentNodeIterator>, T)':
/usr/local/include/crystalspace/csutil/documenthelper.h:56: warning: declaration of 'filter' shadows a member of 'this'
/usr/local/include/crystalspace/csutil/documenthelper.h:56: warning: declaration of 'parent' shadows a member of 'this'
/usr/local/include/crystalspace/csutil/documenthelper.h: In constructor 'CS::DocumentHelper::NodeAttributeCompare::NodeAttributeCompare(const char*)':
/usr/local/include/crystalspace/csutil/documenthelper.h:196: warning: declaration of 'attributeName' shadows a member of 'this'
/usr/local/include/crystalspace/csutil/documenthelper.h: In constructor 'CS::DocumentHelper::NodeValueTest::NodeValueTest(const char*)':
/usr/local/include/crystalspace/csutil/documenthelper.h:226: warning: declaration of 'value' shadows a member of 'this'
/usr/local/include/crystalspace/csutil/documenthelper.h: In constructor 'CS::DocumentHelper::NodeAttributeValueTest::NodeAttributeValueTest(const char*, const char*)':
/usr/local/include/crystalspace/csutil/documenthelper.h:247: warning: declaration of 'value' shadows a member of 'this'
/usr/local/include/crystalspace/csutil/documenthelper.h:247: warning: declaration of 'attribute' shadows a member of 'this'
/usr/local/include/crystalspace/csutil/documenthelper.h: In constructor 'CS::DocumentHelper::NodeAttributeRegexpTest::NodeAttributeRegexpTest(const char*, const char*)':
/usr/local/include/crystalspace/csutil/documenthelper.h:272: warning: declaration of 'attribute' shadows a member of 'this'
/usr/local/include/crystalspace/csutil/filereadhelper.h: In constructor 'csFileReadHelper::csFileReadHelper(iFile*)':
/usr/local/include/crystalspace/csutil/filereadhelper.h:43: warning: declaration of 'file' shadows a member of 'this'
/usr/local/include/crystalspace/csutil/formatter.h: In constructor 'csFmtDefaultWriter<T>::csFmtDefaultWriter(T*, size_t)':
/usr/local/include/crystalspace/csutil/formatter.h:111: warning: declaration of 'size' shadows a member of 'this'
/usr/local/include/crystalspace/csutil/formatter.h:111: warning: declaration of 'dest' shadows a member of 'this'
/usr/local/include/crystalspace/csutil/formatter.h: In constructor 'csPrintfFormatter<Twriter, Treader>::csPrintfFormatter(Treader*, char*)':
/usr/local/include/crystalspace/csutil/formatter.h:1160: warning: declaration of 'reader' shadows a member of 'this'
/usr/local/include/crystalspace/csutil/formatter.h: In constructor 'csPrintfFormatter<Twriter, Treader>::csPrintfFormatter(Treader*, ...)':
/usr/local/include/crystalspace/csutil/formatter.h:1165: warning: declaration of 'reader' shadows a member of 'this'
/usr/local/include/crystalspace/csutil/mmapio.h: In constructor 'csMemoryMappedIO::PlatformMapping::PlatformMapping(csMemoryMappedIO*)':
/usr/local/include/crystalspace/csutil/mmapio.h:110: warning: declaration of 'parent' shadows a member of 'this'
/usr/local/include/crystalspace/csutil/parasiticdatabuffer.h: In member function 'void csParasiticDataBufferBase::SetContents(iDataBuffer*, size_t, size_t)':
/usr/local/include/crystalspace/csutil/parasiticdatabuffer.h:44: warning: declaration of 'size' shadows a member of 'this'
/usr/local/include/crystalspace/csutil/parasiticdatabuffer.h: In constructor 'csParasiticDataBufferBase::csParasiticDataBufferBase(iDataBuffer*, size_t, size_t)':
/usr/local/include/crystalspace/csutil/parasiticdatabuffer.h:55: warning: declaration of 'size' shadows a member of 'this'
/usr/local/include/crystalspace/csutil/parasiticdatabuffer.h: In constructor 'csParasiticDataBuffer::csParasiticDataBuffer(iDataBuffer*, size_t, size_t)':
/usr/local/include/crystalspace/csutil/parasiticdatabuffer.h:96: warning: declaration of 'size' shadows a member of 'this'
/usr/local/include/crystalspace/csutil/parasiticdatabuffer.h: In constructor 'csParasiticDataBufferPooled::csParasiticDataBufferPooled(iDataBuffer*, size_t, size_t)':
/usr/local/include/crystalspace/csutil/parasiticdatabuffer.h:131: warning: declaration of 'size' shadows a member of 'this'
/usr/local/include/crystalspace/csutil/ptrwrap.h: In constructor 'csPtrWrap<T>::csPtrWrap(T*)':
/usr/local/include/crystalspace/csutil/ptrwrap.h:41: warning: declaration of 'ptr' shadows a member of 'this'
/usr/local/include/crystalspace/csutil/ptrwrap.h: In member function 'csPtrWrap<T>& csPtrWrap<T>::operator=(T*)':
/usr/local/include/crystalspace/csutil/ptrwrap.h:52: warning: declaration of 'ptr' shadows a member of 'this'
/usr/local/include/crystalspace/csutil/ptrwrap.h: In member function 'csPtrWrap<T>& csPtrWrap<T>::operator=(const T*)':
/usr/local/include/crystalspace/csutil/ptrwrap.h:53: warning: declaration of 'ptr' shadows a member of 'this'
/usr/local/include/crystalspace/csutil/redblacktree.h: In constructor 'csRedBlackTreeMap<K, T>::TraverseCB<CB>::TraverseCB(const CB&)':
/usr/local/include/crystalspace/csutil/redblacktree.h:565: warning: declaration of 'callback' shadows a member of 'this'
/usr/local/include/crystalspace/csutil/scopedmutexlock.h: In constructor 'csScopedLock<T>::csScopedLock(T&)':
/usr/local/include/crystalspace/csutil/scopedmutexlock.h:61: warning: declaration of 'lock' shadows a member of 'this'
/usr/local/include/crystalspace/imesh/thing.h: In constructor 'csPolygonRange::csPolygonRange(int, int)':
/usr/local/include/crystalspace/imesh/thing.h:53: warning: declaration of 'end' shadows a member of 'this'
/usr/local/include/crystalspace/imesh/thing.h:53: warning: declaration of 'start' shadows a member of 'this'
/usr/local/include/crystalspace/imesh/thing.h: In member function 'void csPolygonRange::Set(int, int)':
/usr/local/include/crystalspace/imesh/thing.h:58: warning: declaration of 'end' shadows a member of 'this'
/usr/local/include/crystalspace/imesh/thing.h:58: warning: declaration of 'start' shadows a member of 'this'
/usr/local/include/crystalspace/csutil/array.h: In constructor 'csArrayCapacityLinear<Threshold>::csArrayCapacityLinear(const Threshold&) [with Threshold = csArrayThresholdVariable]':
/usr/local/include/crystalspace/csutil/array.h:327:   instantiated from here
/usr/local/include/crystalspace/csutil/array.h:284: warning: declaration of 'threshold' shadows a member of 'this'
/usr/local/include/crystalspace/csutil/csstring.h: In constructor 'csStringFast<LEN>::csStringFast(size_t) [with int LEN = 36]':
/usr/local/include/crystalspace/csutil/csstring.h:1170:   instantiated from here
/usr/local/include/crystalspace/csutil/csstring.h:1011: warning: declaration of 'Length' shadows a member of 'this'
/usr/local/include/crystalspace/csgeom/vector4.h: In constructor 'csVector4T<T>::csVector4T(const T&) [with T = float]':
/usr/local/include/crystalspace/csgeom/vector4.h:319:   instantiated from here
/usr/local/include/crystalspace/csgeom/vector4.h:80: warning: declaration of 'm' shadows a member of 'this'
/usr/local/include/crystalspace/csutil/scfarray.h: In constructor 'scfArrayWrapConst<IF, Backend>::scfArrayWrapConst(const Backend&, iBase*) [with IF = iGradientShades, Backend = csArray<csGradientShade, csArrayElementHandler<csGradientShade>, CS::Memory::AllocatorMalloc, csArrayCapacityDefault>]':
/usr/local/include/crystalspace/csgfx/gradient.h:68:   instantiated from here
/usr/local/include/crystalspace/csutil/scfarray.h:259: warning: declaration of 'scfParent' shadows a member of 'this'
/usr/local/include/crystalspace/csutil/scfarray.h:259: warning: declaration of 'storage' shadows a member of 'this'
/usr/local/include/crystalspace/csutil/array.h: In member function 'void csArray<T, ElementHandler, MemoryAllocator, CapacityHandler>::InitRegion(size_t, size_t) [with T = const char*, ElementHandler = csStringArrayElementHandler, MemoryAllocator = CS::Memory::AllocatorMalloc, CapacityHandler = csArrayCapacityDefault]':
/usr/local/include/crystalspace/csutil/stringarray.h:153:   instantiated from here
/usr/local/include/crystalspace/csutil/array.h:386: warning: declaration of 'count' shadows a member of 'this'
/usr/local/include/crystalspace/csutil/scf_impl.h: In constructor 'scfImplementation2<Class, I1, I2>::scfImplementation2(Class*, iBase*) [with Class = csEventQueue::PreProcessFrameEventDispatcher, I1 = csEventQueue::iTypedFrameEventDispatcher, I2 = scfFakeInterface<iEventHandler>]':
/usr/local/include/crystalspace/csutil/cseventq.h:274:   instantiated from here
/usr/local/include/crystalspace/csutil/scf_impl.h:173: warning: declaration of 'parent' shadows a member of 'this'
/usr/local/include/crystalspace/csutil/scf_impl.h: In constructor 'scfImplementation2<Class, I1, I2>::scfImplementation2(Class*, iBase*) [with Class = csEventQueue::ProcessFrameEventDispatcher, I1 = csEventQueue::iTypedFrameEventDispatcher, I2 = scfFakeInterface<iEventHandler>]':
/usr/local/include/crystalspace/csutil/cseventq.h:289:   instantiated from here
/usr/local/include/crystalspace/csutil/scf_impl.h:173: warning: declaration of 'parent' shadows a member of 'this'
/usr/local/include/crystalspace/csutil/scf_impl.h: In constructor 'scfImplementation2<Class, I1, I2>::scfImplementation2(Class*, iBase*) [with Class = csEventQueue::PostProcessFrameEventDispatcher, I1 = csEventQueue::iTypedFrameEventDispatcher, I2 = scfFakeInterface<iEventHandler>]':
/usr/local/include/crystalspace/csutil/cseventq.h:304:   instantiated from here
/usr/local/include/crystalspace/csutil/scf_impl.h:173: warning: declaration of 'parent' shadows a member of 'this'
/usr/local/include/crystalspace/csutil/scf_impl.h: In constructor 'scfImplementation2<Class, I1, I2>::scfImplementation2(Class*, iBase*) [with Class = csEventQueue::FinalProcessFrameEventDispatcher, I1 = csEventQueue::iTypedFrameEventDispatcher, I2 = scfFakeInterface<iEventHandler>]':
/usr/local/include/crystalspace/csutil/cseventq.h:319:   instantiated from here
/usr/local/include/crystalspace/csutil/scf_impl.h:173: warning: declaration of 'parent' shadows a member of 'this'
/usr/local/include/crystalspace/csutil/allocator.h: In constructor 'CS::Memory::AllocatorPointerWrapper<T, Allocator>::AllocatorPointerWrapper(T*) [with T = csPathsList::Entry, Allocator = CS::Memory::AllocatorMalloc]':
/usr/local/include/crystalspace/csutil/array.h:508:   instantiated from 'csArray<T, ElementHandler, MemoryAllocator, CapacityHandler>::csArray(const csArray<T, ElementHandler, MemoryAllocator, CapacityHandler>&) [with T = csPathsList::Entry, ElementHandler = csArrayElementHandler<csPathsList::Entry>, MemoryAllocator = CS::Memory::AllocatorMalloc, CapacityHandler = csArrayCapacityDefault]'
/usr/local/include/crystalspace/csutil/syspath.h:102:   instantiated from here
/usr/local/include/crystalspace/csutil/allocator.h:245: warning: declaration of 'p' shadows a member of 'this'
/usr/local/include/crystalspace/csutil/allocator.h: In constructor 'CS::Memory::AllocatorPointerWrapper<T, Allocator>::AllocatorPointerWrapper(T*) [with T = csHash<csEvent::attribute*, long unsigned int, CS::Memory::AllocatorMalloc>::Element, Allocator = CS::Memory::AllocatorMalloc]':
/usr/local/include/crystalspace/csutil/array.h:508:   instantiated from 'csArray<T, ElementHandler, MemoryAllocator, CapacityHandler>::csArray(const csArray<T, ElementHandler, MemoryAllocator, CapacityHandler>&) [with T = csHash<csEvent::attribute*, long unsigned int, CS::Memory::AllocatorMalloc>::Element, ElementHandler = csArrayElementHandler<csHash<csEvent::attribute*, long unsigned int, CS::Memory::AllocatorMalloc>::Element>, MemoryAllocator = CS::Memory::AllocatorMalloc, CapacityHandler = csArrayCapacityDefault]'
/usr/local/include/crystalspace/csutil/hash.h:298:   instantiated from 'void csHash<T, K, ArrayMemoryAlloc>::Grow() [with T = csEvent::attribute*, K = long unsigned int, ArrayMemoryAlloc = CS::Memory::AllocatorMalloc]'
/usr/local/include/crystalspace/csutil/hash.h:359:   instantiated from 'void csHash<T, K, ArrayMemoryAlloc>::Put(const K&, const T&) [with T = csEvent::attribute*, K = long unsigned int, ArrayMemoryAlloc = CS::Memory::AllocatorMalloc]'
/usr/local/include/crystalspace/csutil/csevent.h:103:   instantiated from 'bool csEvent::InternalAddInt(const char*, T) [with T = signed char]'
/usr/local/include/crystalspace/csutil/csevent.h:214:   instantiated from here
/usr/local/include/crystalspace/csutil/allocator.h:245: warning: declaration of 'p' shadows a member of 'this'
make[2]: *** [BitmapFont.lo] Fehler 1
make[2]: Leaving directory `/home1/hvh/BZFLAG/bzflag_svn_cs_branch/bzflag/src/3D'
make[1]: *** [all-recursive] Fehler 1
make[1]: Leaving directory `/home1/hvh/BZFLAG/bzflag_svn_cs_branch/bzflag/src'
make: *** [all-recursive] Fehler 1
hv