Found multiple versions of which, using the one at /bin/which
Toolchain source is at /DEVEL/astfin/build_stamp537/blackfin-toolchain-06r2-5
Kernel source is at /DEVEL/astfin/build_stamp537/uClinux-dist/linux-2.6.x
Build will be done in /DEVEL/astfin/toolchain_stamp537
Path to elf output dir /DEVEL/astfin/toolchain_stamp537/out-elf
/DEVEL/astfin/toolchain_stamp537/out-elf already exists - cleaning
Path to uClinux output dir /DEVEL/astfin/toolchain_stamp537/out-uclinux
/DEVEL/astfin/toolchain_stamp537/out-uclinux already exists - cleaning
U-Boot Source not specified: addon utilties (like 'mkimage') will not be built
Path to uClibc Config files /DEVEL/astfin/build_stamp537/uClinux-dist/uClibc/extra/Configs/
Path to binutils dir /DEVEL/astfin/build_stamp537/blackfin-toolchain-06r2-5/binutils/binutils-2.17
Path to elf2flt dir /DEVEL/astfin/build_stamp537/blackfin-toolchain-06r2-5/elf2flt
Path to genext2fs /DEVEL/astfin/build_stamp537/blackfin-toolchain-06r2-5/genext2fs
Path to cramfs-tools /DEVEL/astfin/build_stamp537/blackfin-toolchain-06r2-5/cramfs-1.1
Creating log file /DEVEL/astfin/toolchain_stamp537/logs/log
Removing old build dir
*** Configuring Elf Binutils & GDB Mon Apr 30 13:51:13 UTC 2007
*** Building Elf Binutils & GDB Mon Apr 30 13:51:16 UTC 2007
Build error. Last logfile entries:
make[3]: Entering directory `/DEVEL/astfin/toolchain_stamp537/binutils_build/bfd/po'
make[3]: Nothing to be done for `info'.
make[3]: Leaving directory `/DEVEL/astfin/toolchain_stamp537/binutils_build/bfd/po'
make[3]: Entering directory `/DEVEL/astfin/toolchain_stamp537/binutils_build/bfd'
make[3]: Nothing to be done for `info-am'.
make[3]: Leaving directory `/DEVEL/astfin/toolchain_stamp537/binutils_build/bfd'
make[2]: *** [info-recursive] Error 1
make[2]: Leaving directory `/DEVEL/astfin/toolchain_stamp537/binutils_build/bfd'
make[1]: *** [all-bfd] Error 2
make[1]: Leaving directory `/DEVEL/astfin/toolchain_stamp537/binutils_build'
make: *** [/DEVEL/astfin/build_stamp537/blackfin-toolchain-06r2-5/.configured] Error 1