All pastes #465444 Raw Edit

Compile Error

public text v1 · immutable
#465444 ·published 2007-04-30 10:47 UTC
rendered paste body
mkdir -p /home/rahmed/trunk/bin/packages
find /home/rahmed/trunk/build_mipsel/linux-2.4-brcm/packages/ipkg/kmod-usb-pwc -name CVS   | xargs -r rm -rf
find /home/rahmed/trunk/build_mipsel/linux-2.4-brcm/packages/ipkg/kmod-usb-pwc -name .svn  | xargs -r rm -rf
find /home/rahmed/trunk/build_mipsel/linux-2.4-brcm/packages/ipkg/kmod-usb-pwc -name '.#*' | xargs -r rm -f
NM="mipsel-linux-uclibc-nm" STRIP="/home/rahmed/trunk/staging_dir_mipsel/bin/sstrip" STRIP_KMOD="mipsel-linux-uclibc-strip --strip-unneeded --remove-section=.comment" /home/rahmed/trunk/scripts/rstrip.sh /home/rahmed/trunk/build_mipsel/linux-2.4-brcm/packages/ipkg/kmod-usb-pwc
rstrip.sh: /home/rahmed/trunk/build_mipsel/linux-2.4-brcm/packages/ipkg/kmod-usb-pwc/lib/modules/2.4.34/pwc.o:relocatable
ipkg-build -c -o 0 -g 0 /home/rahmed/trunk/build_mipsel/linux-2.4-brcm/packages/ipkg/kmod-usb-pwc /home/rahmed/trunk/bin/packages
Packaged contents of /home/rahmed/trunk/build_mipsel/linux-2.4-brcm/packages/ipkg/kmod-usb-pwc into /home/rahmed/trunk/bin/packages/kmod-usb-pwc_2.4.34-brcm-1_mipsel.ipk
make[3]: Leaving directory `/home/rahmed/trunk/package/kernel'
make -C gmp compile
make[3]: Entering directory `/home/rahmed/trunk/package/gmp'
make[3]: `compile' is up to date.
make[3]: Leaving directory `/home/rahmed/trunk/package/gmp'
make -C openswan compile
make[3]: Entering directory `/home/rahmed/trunk/package/openswan'
make[3]: `compile' is up to date.
make[3]: Leaving directory `/home/rahmed/trunk/package/openswan'
make -C switch compile
make[3]: Entering directory `/home/rahmed/trunk/package/switch'
make[3]: `compile' is up to date.
make[3]: Leaving directory `/home/rahmed/trunk/package/switch'
make -C wireless-tools compile
make[3]: Entering directory `/home/rahmed/trunk/package/wireless-tools'
make[3]: `compile' is up to date.
make[3]: Leaving directory `/home/rahmed/trunk/package/wireless-tools'
make -C wlcompat compile
make[3]: Entering directory `/home/rahmed/trunk/package/wlcompat'
WARNING: skipping kmod-wlcompat-debug -- package not selected
make[3]: Leaving directory `/home/rahmed/trunk/package/wlcompat'
make -C zlib compile
make[3]: Entering directory `/home/rahmed/trunk/package/zlib'
make -C /home/rahmed/trunk/build_mipsel/zlib-1.2.3 AR=mipsel-linux-uclibc-ar AS="mipsel-linux-uclibc-gcc -c -Os -pipe -mips32 -mtune=mips32 -funit-at-a-time" LD=mipsel-linux-uclibc-ld NM=mipsel-linux-uclibc-nm CC="mipsel-linux-uclibc-gcc" GCC="mipsel-linux-uclibc-gcc" CXX=mipsel-linux-uclibc-g++ RANLIB=mipsel-linux-uclibc-ranlib STRIP=mipsel-linux-uclibc-strip OBJCOPY=mipsel-linux-uclibc-objcopy OBJDUMP=mipsel-linux-uclibc-objdump CFLAGS="-Os -pipe -mips32 -mtune=mips32 -funit-at-a-time " libz.a libz.so
make[4]: Entering directory `/home/rahmed/trunk/build_mipsel/zlib-1.2.3'
make[4]: `libz.a' is up to date.
mipsel-linux-uclibc-gcc -lc -o libz.so.1.2.3 adler32.o compress.o crc32.o gzio.o uncompr.o deflate.o trees.o zutil.o inflate.o infback.o inftrees.o inffast.o
/home/rahmed/trunk/staging_dir_mipsel/lib/gcc/mipsel-linux-uclibc/3.4.6/../../../../mipsel-linux-uclibc/lib/crt1.o: In function `__start':
crt1.S:(.text+0x1c): undefined reference to `main'
collect2: ld returned 1 exit status
make[4]: *** [libz.so.1.2.3] Error 1
make[4]: Leaving directory `/home/rahmed/trunk/build_mipsel/zlib-1.2.3'
make[3]: *** [/home/rahmed/trunk/build_mipsel/zlib-1.2.3/.built] Error 2
make[3]: Leaving directory `/home/rahmed/trunk/package/zlib'
make[2]: *** [zlib-compile] Error 2
make[2]: Leaving directory `/home/rahmed/trunk/package'
make[1]: *** [package/compile] Error 2
make[1]: Leaving directory `/home/rahmed/trunk'
make: *** [world] Error 2
rahmed@Linux:~/trunk>