All pastes #463052 Raw Edit

Stuff

public text v1 · immutable
#463052 ·published 2007-04-28 18:40 UTC
rendered paste body
nice cmake -DCMAKE_INSTALL_PREFIX=$KDEDIR -DCMAKE_BUILD_TYPE=debugfull ../multimedia/ && nice make VERBOSE=1 && nice make install
-- Found Qt-Version 4.3.0-snapshot-20070423
-- Found X11: /usr/X11R6/lib64/libX11.so
-- Found KDE4 include dir: /home/amarok-dev/kde/include
-- Found KDE4 library dir: /home/amarok-dev/kde/lib
-- Found KDE4 kconfig_compiler preprocessor: /home/amarok-dev/kde/bin/kconfig_compiler
-- Found Qt-Version 4.3.0-snapshot-20070423
-- Found X11: /usr/X11R6/lib64/libX11.so
-- Found KDE4 include dir: /home/amarok-dev/kde/include
-- Found KDE4 library dir: /home/amarok-dev/kde/lib
-- Found KDE4 kconfig_compiler preprocessor: /home/amarok-dev/kde/bin/kconfig_compiler
-- Found Taglib: /usr/lib64/libtag.so
-- Ruby found: /usr/lib64/libruby.so
-- MySQL not found.
-- MySQL Embedded not found.
-- Found PostgreSQL: /usr/include, /usr/lib64/libpq.so
-- Found MP4V2: /usr/lib64/libmp4v2.so
-- Found Xine library: /usr/lib64/libxine.so
-- PATH: /opt/RealPlayer
-- Found Helix/Realplayer: /opt/RealPlayer/common
-- /home/amarok-dev/multimedia/amarok/src/vis: skipped subdir $(LIBVISUAL_BUILD)
-- Found ALSA: /usr/lib64/libasound.so
-- Read ipod directory
-- Configuring done
-- Generating done
-- Build files have been written to: /home/amarok-dev/amarok-build
/usr/bin/cmake -H/home/amarok-dev/multimedia -B/home/amarok-dev/amarok-build --check-build-system CMakeFiles/Makefile.cmake 0
/usr/bin/cmake -E cmake_progress_start /home/amarok-dev/amarok-build/CMakeFiles 100
make -f CMakeFiles/Makefile2 all
make[1]: Entering directory `/home/amarok-dev/amarok-build'
make -f amarok/src/metadata/CMakeFiles/amarok_taglib.dir/build.make amarok/src/metadata/CMakeFiles/amarok_taglib.dir/depend
make[2]: Entering directory `/home/amarok-dev/amarok-build'
make[2]: Nothing to be done for `amarok/src/metadata/CMakeFiles/amarok_taglib.dir/depend'.
make[2]: Leaving directory `/home/amarok-dev/amarok-build'
make -f amarok/src/metadata/CMakeFiles/amarok_taglib.dir/build.make amarok/src/metadata/CMakeFiles/amarok_taglib.dir/build
make[2]: Entering directory `/home/amarok-dev/amarok-build'
/usr/bin/cmake -E cmake_progress_report /home/amarok-dev/amarok-build/CMakeFiles
[  0%] Building CXX object amarok/src/metadata/CMakeFiles/amarok_taglib.dir/tplugins.o
/usr/bin/c++   -Damarok_taglib_EXPORTS   -Wnon-virtual-dtor -Wno-long-long -ansi -Wundef -Wcast-align -Wchar-subscripts -Wall -W -Wpointer-arith -Wformat-security -fno-exceptions -fno-check-new -fno-common -fno-threadsafe-statics -fvisibility=hidden -Wnon-virtual-dtor -Wno-long-long -ansi -Wundef -Wcast-align -Wchar-subscripts -Wall -W -Wpointer-arith -Wformat-security -fno-exceptions -fno-check-new -fno-common -fno-threadsafe-statics -fvisibility=hidden -g3 -fno-inline -fPIC -I/home/amarok-dev/amarok-build/amarok/src/metadata -I/home/amarok-dev/multimedia/amarok/src/metadata -I/home/amarok-dev/multimedia -I/home/amarok-dev/amarok-build -I/home/amarok-dev/multimedia/amarok -I/home/amarok-dev/amarok-build/amarok -I/home/amarok-dev/multimedia/amarok/src/metadata/.. -I/home/amarok-dev/qt-copy/include -I/home/amarok-dev/qt-copy/include/Qt -I/home/amarok-dev/qt-copy/mkspecs/default -I/home/amarok-dev/qt-copy/include/QtCore -I/home/amarok-dev/qt-copy/include/QtGui -I/home/amarok-dev/qt-copy/include/Qt3Support -I/home/amarok-dev/qt-copy/include/QtAssistant -I/home/amarok-dev/qt-copy/include/QtDesigner -I/home/amarok-dev/qt-copy/include/QtNetwork -I/home/amarok-dev/qt-copy/include/QtOpenGL -I/home/amarok-dev/qt-copy/include/QtSql -I/home/amarok-dev/qt-copy/include/QtXml -I/home/amarok-dev/qt-copy/include/QtSvg -I/home/amarok-dev/qt-copy/include/QtScript -I/home/amarok-dev/qt-copy/include/QtUiTools -I/home/amarok-dev/qt-copy/include/QtTest -I/home/amarok-dev/qt-copy/include/QtDBus -I/home/amarok-dev/kde/include -I/home/amarok-dev/kde/include/KDE -I/usr/local/include   -D_BSD_SOURCE -D_XOPEN_SOURCE=500 -D_BSD_SOURCE -D_GNU_SOURCE -DQT_NO_STL -DQT_NO_CAST_TO_ASCII -D_REENTRANT -DKDE_DEPRECATED_WARNINGS -DHAVE_CONFIG_H=1 -D_BSD_SOURCE -DQT3_SUPPORT -DQT3_SUPPORT_WARNINGS -D_XOPEN_SOURCE=500 -D_BSD_SOURCE -D_GNU_SOURCE -DQT_NO_STL -DQT_NO_CAST_TO_ASCII -D_REENTRANT -DKDE_DEPRECATED_WARNINGS _taglibCflags -DHAVE_MP4V2 _taglibCflags -o amarok/src/metadata/CMakeFiles/amarok_taglib.dir/tplugins.o -c /home/amarok-dev/multimedia/amarok/src/metadata/tplugins.cpp
c++: _taglibCflags: No such file or directory
c++: _taglibCflags: No such file or directory
/home/amarok-dev/multimedia/amarok/src/metadata/tplugins.cpp:31:21: error: fileref.h: No such file or directory
/home/amarok-dev/multimedia/amarok/src/metadata/tplugins.cpp:32:19: error: tfile.h: No such file or directory
In file included from /home/amarok-dev/multimedia/amarok/src/metadata/mp4/mp4file.h:26,
                 from /home/amarok-dev/multimedia/amarok/src/metadata/tplugins.cpp:36:
/home/amarok-dev/multimedia/amarok/src/metadata/mp4/mp4properties.h:25:29: error: audioproperties.h: No such file or directory
/home/amarok-dev/multimedia/amarok/src/metadata/mp4/mp4properties.h:26:21: error: tstring.h: No such file or directory
In file included from /home/amarok-dev/multimedia/amarok/src/metadata/tplugins.cpp:47:
/home/amarok-dev/multimedia/amarok/src/metadata/speex/speexfile.h:29:21: error: oggfile.h: No such file or directory
/home/amarok-dev/multimedia/amarok/src/metadata/speex/speexfile.h:30:25: error: xiphcomment.h: No such file or directory
In file included from /home/amarok-dev/multimedia/amarok/src/metadata/tplugins.cpp:49:
/home/amarok-dev/multimedia/amarok/src/metadata/wma/wmafile.h:26:17: error: tag.h: No such file or directory
In file included from /home/amarok-dev/multimedia/amarok/src/metadata/wma/wmafile.h:28,
                 from /home/amarok-dev/multimedia/amarok/src/metadata/tplugins.cpp:49:
/home/amarok-dev/multimedia/amarok/src/metadata/wma/wmatag.h:25:18: error: tmap.h: No such file or directory
In file included from /home/amarok-dev/multimedia/amarok/src/metadata/wma/wmatag.h:28,
                 from /home/amarok-dev/multimedia/amarok/src/metadata/wma/wmafile.h:28,
                 from /home/amarok-dev/multimedia/amarok/src/metadata/tplugins.cpp:49:
/home/amarok-dev/multimedia/amarok/src/metadata/wma/wmaattribute.h:26:25: error: tbytevector.h: No such file or directory
In file included from /home/amarok-dev/multimedia/amarok/src/metadata/audible/audibleproperties.h:29,
                 from /home/amarok-dev/multimedia/amarok/src/metadata/audible/taglib_audiblefile.h:30,
                 from /home/amarok-dev/multimedia/amarok/src/metadata/tplugins.cpp:53:
/home/amarok-dev/amarok-build/config.h:175:1: warning: "PACKAGE_BUGREPORT" redefined
In file included from /usr/include/mp4.h:35,
                 from /home/amarok-dev/multimedia/amarok/src/metadata/mp4/mp4properties.h:27,
                 from /home/amarok-dev/multimedia/amarok/src/metadata/mp4/mp4file.h:26,
                 from /home/amarok-dev/multimedia/amarok/src/metadata/tplugins.cpp:36:
/usr/include/libmp4v2/mpeg4ip.h:47:1: warning: this is the location of the previous definition
In file included from /home/amarok-dev/multimedia/amarok/src/metadata/audible/audibleproperties.h:29,
                 from /home/amarok-dev/multimedia/amarok/src/metadata/audible/taglib_audiblefile.h:30,
                 from /home/amarok-dev/multimedia/amarok/src/metadata/tplugins.cpp:53:
/home/amarok-dev/amarok-build/config.h:178:1: warning: "PACKAGE_NAME" redefined
In file included from /usr/include/mp4.h:35,
                 from /home/amarok-dev/multimedia/amarok/src/metadata/mp4/mp4properties.h:27,
                 from /home/amarok-dev/multimedia/amarok/src/metadata/mp4/mp4file.h:26,
                 from /home/amarok-dev/multimedia/amarok/src/metadata/tplugins.cpp:36:
/usr/include/libmp4v2/mpeg4ip.h:48:1: warning: this is the location of the previous definition
In file included from /home/amarok-dev/multimedia/amarok/src/metadata/audible/audibleproperties.h:29,
                 from /home/amarok-dev/multimedia/amarok/src/metadata/audible/taglib_audiblefile.h:30,
                 from /home/amarok-dev/multimedia/amarok/src/metadata/tplugins.cpp:53:
/home/amarok-dev/amarok-build/config.h:181:1: warning: "PACKAGE_STRING" redefined
In file included from /usr/include/mp4.h:35,
                 from /home/amarok-dev/multimedia/amarok/src/metadata/mp4/mp4properties.h:27,
                 from /home/amarok-dev/multimedia/amarok/src/metadata/mp4/mp4file.h:26,
                 from /home/amarok-dev/multimedia/amarok/src/metadata/tplugins.cpp:36:
/usr/include/libmp4v2/mpeg4ip.h:49:1: warning: this is the location of the previous definition
In file included from /home/amarok-dev/multimedia/amarok/src/metadata/audible/audibleproperties.h:29,
                 from /home/amarok-dev/multimedia/amarok/src/metadata/audible/taglib_audiblefile.h:30,
                 from /home/amarok-dev/multimedia/amarok/src/metadata/tplugins.cpp:53:
/home/amarok-dev/amarok-build/config.h:184:1: warning: "PACKAGE_TARNAME" redefined
In file included from /usr/include/mp4.h:35,
                 from /home/amarok-dev/multimedia/amarok/src/metadata/mp4/mp4properties.h:27,
                 from /home/amarok-dev/multimedia/amarok/src/metadata/mp4/mp4file.h:26,
                 from /home/amarok-dev/multimedia/amarok/src/metadata/tplugins.cpp:36:
/usr/include/libmp4v2/mpeg4ip.h:50:1: warning: this is the location of the previous definition
In file included from /home/amarok-dev/multimedia/amarok/src/metadata/audible/audibleproperties.h:29,
                 from /home/amarok-dev/multimedia/amarok/src/metadata/audible/taglib_audiblefile.h:30,
                 from /home/amarok-dev/multimedia/amarok/src/metadata/tplugins.cpp:53:
/home/amarok-dev/amarok-build/config.h:187:1: warning: "PACKAGE_VERSION" redefined
In file included from /usr/include/mp4.h:35,
                 from /home/amarok-dev/multimedia/amarok/src/metadata/mp4/mp4properties.h:27,
                 from /home/amarok-dev/multimedia/amarok/src/metadata/mp4/mp4file.h:26,
                 from /home/amarok-dev/multimedia/amarok/src/metadata/tplugins.cpp:36:
/usr/include/libmp4v2/mpeg4ip.h:51:1: warning: this is the location of the previous definition
In file included from /home/amarok-dev/multimedia/amarok/src/metadata/audible/audibleproperties.h:29,
                 from /home/amarok-dev/multimedia/amarok/src/metadata/audible/taglib_audiblefile.h:30,
                 from /home/amarok-dev/multimedia/amarok/src/metadata/tplugins.cpp:53:
/home/amarok-dev/amarok-build/config.h:196:1: warning: "SIZEOF_LONG" redefined
In file included from /usr/include/libmp4v2/mpeg4ip.h:41,
                 from /usr/include/mp4.h:35,
                 from /home/amarok-dev/multimedia/amarok/src/metadata/mp4/mp4properties.h:27,
                 from /home/amarok-dev/multimedia/amarok/src/metadata/mp4/mp4file.h:26,
                 from /home/amarok-dev/multimedia/amarok/src/metadata/tplugins.cpp:36:
/usr/include/libmp4v2/mpeg4ip_config.h:189:1: warning: this is the location of the previous definition
/home/amarok-dev/multimedia/amarok/src/metadata/tplugins.cpp:58:22: error: mpegfile.h: No such file or directory
/home/amarok-dev/multimedia/amarok/src/metadata/tplugins.cpp:60:25: error: oggflacfile.h: No such file or directory
/home/amarok-dev/multimedia/amarok/src/metadata/tplugins.cpp:61:24: error: vorbisfile.h: No such file or directory
/home/amarok-dev/multimedia/amarok/src/metadata/tplugins.cpp:62:22: error: flacfile.h: No such file or directory
/home/amarok-dev/multimedia/amarok/src/metadata/tplugins.cpp:63:21: error: mpcfile.h: No such file or directory
/home/amarok-dev/multimedia/amarok/src/metadata/mp4/taglib_mp4filetyperesolver.h:32: error: 'TagLib' has not been declared
/home/amarok-dev/multimedia/amarok/src/metadata/mp4/taglib_mp4filetyperesolver.h:32: error: expected `{' before 'FileTypeResolver'
/home/amarok-dev/multimedia/amarok/src/metadata/mp4/taglib_mp4filetyperesolver.h:32: error: invalid function declaration
/home/amarok-dev/multimedia/amarok/src/metadata/mp4/mp4properties.h:45: error: expected class-name before '{' token
/home/amarok-dev/multimedia/amarok/src/metadata/mp4/mp4properties.h:50: error: 'TagLib::AudioProperties' has not been declared
/home/amarok-dev/multimedia/amarok/src/metadata/mp4/mp4properties.h:50: error: expected ',' or '...' before 'style'
/home/amarok-dev/multimedia/amarok/src/metadata/mp4/mp4file.h:35: error: expected class-name before '{' token
/home/amarok-dev/multimedia/amarok/src/metadata/mp4/mp4file.h:43: error: 'TagLib::AudioProperties' has not been declared
/home/amarok-dev/multimedia/amarok/src/metadata/mp4/mp4file.h:43: error: expected ',' or '...' before 'propertiesStyle'
/home/amarok-dev/multimedia/amarok/src/metadata/mp4/mp4file.h:52: error: ISO C++ forbids declaration of 'Tag' with no type
/home/amarok-dev/multimedia/amarok/src/metadata/mp4/mp4file.h:52: error: invalid use of '::'
/home/amarok-dev/multimedia/amarok/src/metadata/mp4/mp4file.h:52: error: 'Tag' declared as a 'virtual' field
/home/amarok-dev/multimedia/amarok/src/metadata/mp4/mp4file.h:52: error: expected ';' before '*' token
/home/amarok-dev/multimedia/amarok/src/metadata/mp4/mp4file.h:68: error: 'TagLib::AudioProperties' has not been declared
/home/amarok-dev/multimedia/amarok/src/metadata/mp4/mp4file.h:68: error: expected ',' or '...' before 'propertiesStyle'
/home/amarok-dev/multimedia/amarok/src/metadata/mp4/mp4file.h:44: error: default argument missing for parameter 3 of 'TagLib::MP4::File::File(const char*, bool, int)'
/home/amarok-dev/multimedia/amarok/src/metadata/trueaudio/taglib_trueaudiofiletyperesolver.h:29: error: 'TagLib::FileRef' has not been declared
/home/amarok-dev/multimedia/amarok/src/metadata/trueaudio/taglib_trueaudiofiletyperesolver.h:29: error: expected `{' before 'FileTypeResolver'
/home/amarok-dev/multimedia/amarok/src/metadata/trueaudio/taglib_trueaudiofiletyperesolver.h:29: error: invalid function declaration
/home/amarok-dev/multimedia/amarok/src/metadata/trueaudio/ttaproperties.h:47: error: expected class-name before '{' token
/home/amarok-dev/multimedia/amarok/src/metadata/trueaudio/ttaproperties.h:53: error: expected ',' or '...' before '&' token
/home/amarok-dev/multimedia/amarok/src/metadata/trueaudio/ttaproperties.h:53: error: ISO C++ forbids declaration of 'ByteVector' with no type
/home/amarok-dev/multimedia/amarok/src/metadata/trueaudio/ttafile.h:61: error: expected class-name before '{' token
/home/amarok-dev/multimedia/amarok/src/metadata/trueaudio/ttafile.h:84: error: 'class TagLib::TTA::Properties::ReadStyle' has not been declared
/home/amarok-dev/multimedia/amarok/src/metadata/trueaudio/ttafile.h:94: error: 'class TagLib::TTA::Properties::ReadStyle' has not been declared
/home/amarok-dev/multimedia/amarok/src/metadata/trueaudio/ttafile.h:167: error: 'class TagLib::TTA::Properties::ReadStyle' has not been declared
/home/amarok-dev/multimedia/amarok/src/metadata/trueaudio/ttafile.h:84: error: 'Average' is not a member of 'TagLib::TTA::Properties'
/home/amarok-dev/multimedia/amarok/src/metadata/trueaudio/ttafile.h:94: error: 'Average' is not a member of 'TagLib::TTA::Properties'
/home/amarok-dev/multimedia/amarok/src/metadata/wavpack/taglib_wavpackfiletyperesolver.h:29: error: 'TagLib::FileRef' has not been declared
/home/amarok-dev/multimedia/amarok/src/metadata/wavpack/taglib_wavpackfiletyperesolver.h:29: error: expected `{' before 'FileTypeResolver'
/home/amarok-dev/multimedia/amarok/src/metadata/wavpack/taglib_wavpackfiletyperesolver.h:29: error: invalid function declaration
/home/amarok-dev/multimedia/amarok/src/metadata/wavpack/wvproperties.h:47: error: expected class-name before '{' token
/home/amarok-dev/multimedia/amarok/src/metadata/wavpack/wvproperties.h:53: error: expected ',' or '...' before '&' token
/home/amarok-dev/multimedia/amarok/src/metadata/wavpack/wvproperties.h:53: error: ISO C++ forbids declaration of 'ByteVector' with no type
/home/amarok-dev/multimedia/amarok/src/metadata/wavpack/wvfile.h:61: error: expected class-name before '{' token
/home/amarok-dev/multimedia/amarok/src/metadata/wavpack/wvfile.h:84: error: 'class TagLib::WavPack::Properties::ReadStyle' has not been declared
/home/amarok-dev/multimedia/amarok/src/metadata/wavpack/wvfile.h:149: error: 'class TagLib::WavPack::Properties::ReadStyle' has not been declared
/home/amarok-dev/multimedia/amarok/src/metadata/wavpack/wvfile.h:84: error: 'Average' is not a member of 'TagLib::WavPack::Properties'
/home/amarok-dev/multimedia/amarok/src/metadata/speex/taglib_speexfiletyperesolver.h:29: error: 'TagLib::FileRef' has not been declared
/home/amarok-dev/multimedia/amarok/src/metadata/speex/taglib_speexfiletyperesolver.h:29: error: expected `{' before 'FileTypeResolver'
/home/amarok-dev/multimedia/amarok/src/metadata/speex/taglib_speexfiletyperesolver.h:29: error: invalid function declaration
/home/amarok-dev/multimedia/amarok/src/metadata/speex/speexproperties.h:45: error: expected class-name before '{' token
/home/amarok-dev/multimedia/amarok/src/metadata/speex/speexproperties.h:51: error: 'ReadStyle' has not been declared
/home/amarok-dev/multimedia/amarok/src/metadata/speex/speexproperties.h:51: error: 'Average' was not declared in this scope
/home/amarok-dev/multimedia/amarok/src/metadata/speex/speexfile.h:49: error: 'Ogg' has not been declared
/home/amarok-dev/multimedia/amarok/src/metadata/speex/speexfile.h:49: error: expected `{' before 'File'
/home/amarok-dev/multimedia/amarok/src/metadata/speex/speexfile.h:49: error: invalid function declaration
/home/amarok-dev/multimedia/amarok/src/metadata/wma/taglib_wmafiletyperesolver.h:32: error: 'TagLib::FileRef' has not been declared
/home/amarok-dev/multimedia/amarok/src/metadata/wma/taglib_wmafiletyperesolver.h:32: error: expected `{' before 'FileTypeResolver'
/home/amarok-dev/multimedia/amarok/src/metadata/wma/taglib_wmafiletyperesolver.h:32: error: invalid function declaration
/home/amarok-dev/multimedia/amarok/src/metadata/wma/wmaproperties.h:35: error: expected class-name before '{' token
/home/amarok-dev/multimedia/amarok/src/metadata/wma/wmaattribute.h:60: error: expected ',' or '...' before '&' token
/home/amarok-dev/multimedia/amarok/src/metadata/wma/wmaattribute.h:60: error: ISO C++ forbids declaration of 'String' with no type
/home/amarok-dev/multimedia/amarok/src/metadata/wma/wmaattribute.h:61: error: expected ',' or '...' before '&' token
/home/amarok-dev/multimedia/amarok/src/metadata/wma/wmaattribute.h:61: error: ISO C++ forbids declaration of 'String' with no type
/home/amarok-dev/multimedia/amarok/src/metadata/wma/wmaattribute.h:61: error: 'TagLib::WMA::Attribute::Attribute(int)' cannot be overloaded
/home/amarok-dev/multimedia/amarok/src/metadata/wma/wmaattribute.h:60: error: with 'TagLib::WMA::Attribute::Attribute(int)'
/home/amarok-dev/multimedia/amarok/src/metadata/wma/wmaattribute.h:62: error: expected ',' or '...' before '&' token
/home/amarok-dev/multimedia/amarok/src/metadata/wma/wmaattribute.h:62: error: ISO C++ forbids declaration of 'String' with no type
/home/amarok-dev/multimedia/amarok/src/metadata/wma/wmaattribute.h:62: error: 'TagLib::WMA::Attribute::Attribute(int)' cannot be overloaded
/home/amarok-dev/multimedia/amarok/src/metadata/wma/wmaattribute.h:60: error: with 'TagLib::WMA::Attribute::Attribute(int)'
/home/amarok-dev/multimedia/amarok/src/metadata/wma/wmaattribute.h:63: error: expected ',' or '...' before '&' token
/home/amarok-dev/multimedia/amarok/src/metadata/wma/wmaattribute.h:63: error: ISO C++ forbids declaration of 'String' with no type
/home/amarok-dev/multimedia/amarok/src/metadata/wma/wmaattribute.h:63: error: 'TagLib::WMA::Attribute::Attribute(int)' cannot be overloaded
/home/amarok-dev/multimedia/amarok/src/metadata/wma/wmaattribute.h:60: error: with 'TagLib::WMA::Attribute::Attribute(int)'
/home/amarok-dev/multimedia/amarok/src/metadata/wma/wmaattribute.h:64: error: expected ',' or '...' before '&' token
/home/amarok-dev/multimedia/amarok/src/metadata/wma/wmaattribute.h:64: error: ISO C++ forbids declaration of 'String' with no type
/home/amarok-dev/multimedia/amarok/src/metadata/wma/wmaattribute.h:64: error: 'TagLib::WMA::Attribute::Attribute(int)' cannot be overloaded
/home/amarok-dev/multimedia/amarok/src/metadata/wma/wmaattribute.h:60: error: with 'TagLib::WMA::Attribute::Attribute(int)'
/home/amarok-dev/multimedia/amarok/src/metadata/wma/wmaattribute.h:65: error: expected ',' or '...' before '&' token
/home/amarok-dev/multimedia/amarok/src/metadata/wma/wmaattribute.h:65: error: ISO C++ forbids declaration of 'String' with no type
/home/amarok-dev/multimedia/amarok/src/metadata/wma/wmaattribute.h:65: error: 'TagLib::WMA::Attribute::Attribute(int)' cannot be overloaded
/home/amarok-dev/multimedia/amarok/src/metadata/wma/wmaattribute.h:60: error: with 'TagLib::WMA::Attribute::Attribute(int)'
/home/amarok-dev/multimedia/amarok/src/metadata/wma/wmaattribute.h:80: error: 'String' does not name a type
/home/amarok-dev/multimedia/amarok/src/metadata/wma/wmaattribute.h:90: error: 'String' does not name a type
/home/amarok-dev/multimedia/amarok/src/metadata/wma/wmaattribute.h:95: error: 'ByteVector' does not name a type
/home/amarok-dev/multimedia/amarok/src/metadata/wma/wmaattribute.h:107: error: 'ByteVector' does not name a type
/home/amarok-dev/multimedia/amarok/src/metadata/wma/wmatag.h:34: error: expected initializer before '<' token
/home/amarok-dev/multimedia/amarok/src/metadata/wma/wmatag.h:36: error: invalid use of undefined type 'struct TagLib::Tag'
/home/amarok-dev/multimedia/amarok/src/metadata/trueaudio/ttafile.h:35: error: forward declaration of 'struct TagLib::Tag'
/home/amarok-dev/multimedia/amarok/src/metadata/wma/wmatag.h:49: error: 'String' does not name a type
/home/amarok-dev/multimedia/amarok/src/metadata/wma/wmatag.h:54: error: 'String' does not name a type
/home/amarok-dev/multimedia/amarok/src/metadata/wma/wmatag.h:60: error: 'String' does not name a type
/home/amarok-dev/multimedia/amarok/src/metadata/wma/wmatag.h:65: error: 'String' does not name a type
/home/amarok-dev/multimedia/amarok/src/metadata/wma/wmatag.h:71: error: 'String' does not name a type
/home/amarok-dev/multimedia/amarok/src/metadata/wma/wmatag.h:76: error: 'String' does not name a type
/home/amarok-dev/multimedia/amarok/src/metadata/wma/wmatag.h:82: error: 'String' does not name a type
/home/amarok-dev/multimedia/amarok/src/metadata/wma/wmatag.h:98: error: expected ',' or '...' before '&' token
/home/amarok-dev/multimedia/amarok/src/metadata/wma/wmatag.h:98: error: ISO C++ forbids declaration of 'String' with no type
/home/amarok-dev/multimedia/amarok/src/metadata/wma/wmatag.h:103: error: expected ',' or '...' before '&' token
/home/amarok-dev/multimedia/amarok/src/metadata/wma/wmatag.h:103: error: ISO C++ forbids declaration of 'String' with no type
/home/amarok-dev/multimedia/amarok/src/metadata/wma/wmatag.h:109: error: expected ',' or '...' before '&' token
/home/amarok-dev/multimedia/amarok/src/metadata/wma/wmatag.h:109: error: ISO C++ forbids declaration of 'String' with no type
/home/amarok-dev/multimedia/amarok/src/metadata/wma/wmatag.h:114: error: expected ',' or '...' before '&' token
/home/amarok-dev/multimedia/amarok/src/metadata/wma/wmatag.h:114: error: ISO C++ forbids declaration of 'String' with no type
/home/amarok-dev/multimedia/amarok/src/metadata/wma/wmatag.h:119: error: expected ',' or '...' before '&' token
/home/amarok-dev/multimedia/amarok/src/metadata/wma/wmatag.h:119: error: ISO C++ forbids declaration of 'String' with no type
/home/amarok-dev/multimedia/amarok/src/metadata/wma/wmatag.h:124: error: expected ',' or '...' before '&' token
/home/amarok-dev/multimedia/amarok/src/metadata/wma/wmatag.h:124: error: ISO C++ forbids declaration of 'String' with no type
/home/amarok-dev/multimedia/amarok/src/metadata/wma/wmatag.h:129: error: expected ',' or '...' before '&' token
/home/amarok-dev/multimedia/amarok/src/metadata/wma/wmatag.h:129: error: ISO C++ forbids declaration of 'String' with no type
/home/amarok-dev/multimedia/amarok/src/metadata/wma/wmatag.h:165: error: ISO C++ forbids declaration of 'AttributeMap' with no type
/home/amarok-dev/multimedia/amarok/src/metadata/wma/wmatag.h:165: error: expected ';' before '&' token
/home/amarok-dev/multimedia/amarok/src/metadata/wma/wmatag.h:170: error: expected ',' or '...' before '&' token
/home/amarok-dev/multimedia/amarok/src/metadata/wma/wmatag.h:170: error: ISO C++ forbids declaration of 'ByteVector' with no type
/home/amarok-dev/multimedia/amarok/src/metadata/wma/wmatag.h:172: error: expected ',' or '...' before '&' token
/home/amarok-dev/multimedia/amarok/src/metadata/wma/wmatag.h:172: error: ISO C++ forbids declaration of 'ByteVector' with no type
/home/amarok-dev/multimedia/amarok/src/metadata/wma/wmatag.h:178: error: expected ',' or '...' before '&' token
/home/amarok-dev/multimedia/amarok/src/metadata/wma/wmatag.h:178: error: ISO C++ forbids declaration of 'ByteVector' with no type
/home/amarok-dev/multimedia/amarok/src/metadata/wma/wmatag.h:178: error: 'void TagLib::WMA::Tag::setAttribute(int)' cannot be overloaded
/home/amarok-dev/multimedia/amarok/src/metadata/wma/wmatag.h:172: error: with 'void TagLib::WMA::Tag::setAttribute(int)'
/home/amarok-dev/multimedia/amarok/src/metadata/wma/wmafile.h:42: error: expected class-name before '{' token
/home/amarok-dev/multimedia/amarok/src/metadata/wma/wmafile.h:48: error: 'class TagLib::WMA::Properties::ReadStyle' has not been declared
/home/amarok-dev/multimedia/amarok/src/metadata/wma/wmafile.h:82: error: 'String' has not been declared
/home/amarok-dev/multimedia/amarok/src/metadata/wma/wmafile.h:84: error: 'ByteVector' does not name a type
/home/amarok-dev/multimedia/amarok/src/metadata/wma/wmafile.h:85: error: 'ByteVector' does not name a type
/home/amarok-dev/multimedia/amarok/src/metadata/wma/wmafile.h:87: error: 'class TagLib::WMA::Properties::ReadStyle' has not been declared
/home/amarok-dev/multimedia/amarok/src/metadata/wma/wmafile.h:48: error: 'Average' is not a member of 'TagLib::WMA::Properties'
/home/amarok-dev/multimedia/amarok/src/metadata/rmff/taglib_realmediafiletyperesolver.h:32: error: 'TagLib::FileRef' has not been declared
/home/amarok-dev/multimedia/amarok/src/metadata/rmff/taglib_realmediafiletyperesolver.h:32: error: expected `{' before 'FileTypeResolver'
/home/amarok-dev/multimedia/amarok/src/metadata/rmff/taglib_realmediafiletyperesolver.h:32: error: invalid function declaration
/home/amarok-dev/multimedia/amarok/src/metadata/rmff/taglib_realmediafile.h:45: error: invalid use of undefined type 'struct TagLib::Tag'
/home/amarok-dev/multimedia/amarok/src/metadata/trueaudio/ttafile.h:35: error: forward declaration of 'struct TagLib::Tag'
/home/amarok-dev/multimedia/amarok/src/metadata/rmff/taglib_realmediafile.h:50: error: 'String' does not name a type
/home/amarok-dev/multimedia/amarok/src/metadata/rmff/taglib_realmediafile.h:51: error: 'String' does not name a type
/home/amarok-dev/multimedia/amarok/src/metadata/rmff/taglib_realmediafile.h:52: error: 'String' does not name a type
/home/amarok-dev/multimedia/amarok/src/metadata/rmff/taglib_realmediafile.h:53: error: 'String' does not name a type
/home/amarok-dev/multimedia/amarok/src/metadata/rmff/taglib_realmediafile.h:54: error: 'String' does not name a type
/home/amarok-dev/multimedia/amarok/src/metadata/rmff/taglib_realmediafile.h:57: error: expected ',' or '...' before '&' token
/home/amarok-dev/multimedia/amarok/src/metadata/rmff/taglib_realmediafile.h:57: error: ISO C++ forbids declaration of 'String' with no type
/home/amarok-dev/multimedia/amarok/src/metadata/rmff/taglib_realmediafile.h:58: error: expected ',' or '...' before '&' token
/home/amarok-dev/multimedia/amarok/src/metadata/rmff/taglib_realmediafile.h:58: error: ISO C++ forbids declaration of 'String' with no type
/home/amarok-dev/multimedia/amarok/src/metadata/rmff/taglib_realmediafile.h:59: error: expected ',' or '...' before '&' token
/home/amarok-dev/multimedia/amarok/src/metadata/rmff/taglib_realmediafile.h:59: error: ISO C++ forbids declaration of 'String' with no type
/home/amarok-dev/multimedia/amarok/src/metadata/rmff/taglib_realmediafile.h:60: error: expected ',' or '...' before '&' token
/home/amarok-dev/multimedia/amarok/src/metadata/rmff/taglib_realmediafile.h:60: error: ISO C++ forbids declaration of 'String' with no type
/home/amarok-dev/multimedia/amarok/src/metadata/rmff/taglib_realmediafile.h:61: error: expected ',' or '...' before '&' token
/home/amarok-dev/multimedia/amarok/src/metadata/rmff/taglib_realmediafile.h:61: error: ISO C++ forbids declaration of 'String' with no type
/home/amarok-dev/multimedia/amarok/src/metadata/rmff/taglib_realmediafile.h:76: error: expected class-name before '{' token
/home/amarok-dev/multimedia/amarok/src/metadata/rmff/taglib_realmediafile.h: In constructor 'TagLib::RealMedia::Properties::Properties(TagLib::RealMedia::RealMediaFF*)':
/home/amarok-dev/multimedia/amarok/src/metadata/rmff/taglib_realmediafile.h:78: error: expected class-name before '(' token
/home/amarok-dev/multimedia/amarok/src/metadata/rmff/taglib_realmediafile.h:78: error: 'Average' was not declared in this scope
/home/amarok-dev/multimedia/amarok/src/metadata/rmff/taglib_realmediafile.h: At global scope:
/home/amarok-dev/multimedia/amarok/src/metadata/rmff/taglib_realmediafile.h:91: error: expected class-name before '{' token
/home/amarok-dev/multimedia/amarok/src/metadata/rmff/taglib_realmediafile.h:94: error: 'class TagLib::RealMedia::Properties::ReadStyle' has not been declared
/home/amarok-dev/multimedia/amarok/src/metadata/rmff/taglib_realmediafile.h:94: error: 'Average' is not a member of 'TagLib::RealMedia::Properties'
/home/amarok-dev/multimedia/amarok/src/metadata/audible/taglib_audiblefiletyperesolver.h:29: error: 'TagLib::FileRef' has not been declared
/home/amarok-dev/multimedia/amarok/src/metadata/audible/taglib_audiblefiletyperesolver.h:29: error: expected `{' before 'FileTypeResolver'
/home/amarok-dev/multimedia/amarok/src/metadata/audible/taglib_audiblefiletyperesolver.h:29: error: invalid function declaration
/home/amarok-dev/multimedia/amarok/src/metadata/audible/audibleproperties.h:46: error: expected class-name before '{' token
/home/amarok-dev/multimedia/amarok/src/metadata/audible/audibleproperties.h:51: error: expected `)' before 'style'
/home/amarok-dev/multimedia/amarok/src/metadata/audible/audibletag.h:40: error: invalid use of undefined type 'struct TagLib::Tag'
/home/amarok-dev/multimedia/amarok/src/metadata/trueaudio/ttafile.h:35: error: forward declaration of 'struct TagLib::Tag'
/home/amarok-dev/multimedia/amarok/src/metadata/audible/audibletag.h:59: error: 'String' does not name a type
/home/amarok-dev/multimedia/amarok/src/metadata/audible/audibletag.h:65: error: 'String' does not name a type
/home/amarok-dev/multimedia/amarok/src/metadata/audible/audibletag.h:71: error: 'String' does not name a type
/home/amarok-dev/multimedia/amarok/src/metadata/audible/audibletag.h:77: error: 'String' does not name a type
/home/amarok-dev/multimedia/amarok/src/metadata/audible/audibletag.h:83: error: 'String' does not name a type
/home/amarok-dev/multimedia/amarok/src/metadata/audible/audibletag.h:105: error: expected ',' or '...' before '&' token
/home/amarok-dev/multimedia/amarok/src/metadata/audible/audibletag.h:105: error: ISO C++ forbids declaration of 'String' with no type
/home/amarok-dev/multimedia/amarok/src/metadata/audible/audibletag.h:111: error: expected ',' or '...' before '&' token
/home/amarok-dev/multimedia/amarok/src/metadata/audible/audibletag.h:111: error: ISO C++ forbids declaration of 'String' with no type
/home/amarok-dev/multimedia/amarok/src/metadata/audible/audibletag.h:117: error: expected ',' or '...' before '&' token
/home/amarok-dev/multimedia/amarok/src/metadata/audible/audibletag.h:117: error: ISO C++ forbids declaration of 'String' with no type
/home/amarok-dev/multimedia/amarok/src/metadata/audible/audibletag.h:123: error: expected ',' or '...' before '&' token
/home/amarok-dev/multimedia/amarok/src/metadata/audible/audibletag.h:123: error: ISO C++ forbids declaration of 'String' with no type
/home/amarok-dev/multimedia/amarok/src/metadata/audible/audibletag.h:132: error: expected ',' or '...' before '&' token
/home/amarok-dev/multimedia/amarok/src/metadata/audible/audibletag.h:132: error: ISO C++ forbids declaration of 'String' with no type
/home/amarok-dev/multimedia/amarok/src/metadata/audible/audibletag.h:171: error: 'String' does not name a type
/home/amarok-dev/multimedia/amarok/src/metadata/audible/audibletag.h:172: error: 'String' does not name a type
/home/amarok-dev/multimedia/amarok/src/metadata/audible/audibletag.h:173: error: 'String' does not name a type
/home/amarok-dev/multimedia/amarok/src/metadata/audible/audibletag.h:174: error: 'String' does not name a type
/home/amarok-dev/multimedia/amarok/src/metadata/audible/audibletag.h:175: error: 'String' does not name a type
/home/amarok-dev/multimedia/amarok/src/metadata/audible/audibletag.h: In member function 'virtual void TagLib::Audible::Tag::setTitle(int)':
/home/amarok-dev/multimedia/amarok/src/metadata/audible/audibletag.h:105: error: 'm_title' was not declared in this scope
/home/amarok-dev/multimedia/amarok/src/metadata/audible/audibletag.h:105: error: 's' was not declared in this scope
/home/amarok-dev/multimedia/amarok/src/metadata/audible/audibletag.h: At global scope:
/home/amarok-dev/multimedia/amarok/src/metadata/audible/audibletag.h:105: warning: unused parameter 'String'
/home/amarok-dev/multimedia/amarok/src/metadata/audible/audibletag.h: In member function 'virtual void TagLib::Audible::Tag::setArtist(int)':
/home/amarok-dev/multimedia/amarok/src/metadata/audible/audibletag.h:111: error: 'm_artist' was not declared in this scope
/home/amarok-dev/multimedia/amarok/src/metadata/audible/audibletag.h:111: error: 's' was not declared in this scope
/home/amarok-dev/multimedia/amarok/src/metadata/audible/audibletag.h: At global scope:
/home/amarok-dev/multimedia/amarok/src/metadata/audible/audibletag.h:111: warning: unused parameter 'String'
/home/amarok-dev/multimedia/amarok/src/metadata/audible/audibletag.h: In member function 'virtual void TagLib::Audible::Tag::setAlbum(int)':
/home/amarok-dev/multimedia/amarok/src/metadata/audible/audibletag.h:117: error: 'm_album' was not declared in this scope
/home/amarok-dev/multimedia/amarok/src/metadata/audible/audibletag.h:117: error: 's' was not declared in this scope
/home/amarok-dev/multimedia/amarok/src/metadata/audible/audibletag.h: At global scope:
/home/amarok-dev/multimedia/amarok/src/metadata/audible/audibletag.h:117: warning: unused parameter 'String'
/home/amarok-dev/multimedia/amarok/src/metadata/audible/audibletag.h: In member function 'virtual void TagLib::Audible::Tag::setComment(int)':
/home/amarok-dev/multimedia/amarok/src/metadata/audible/audibletag.h:123: error: 'm_comment' was not declared in this scope
/home/amarok-dev/multimedia/amarok/src/metadata/audible/audibletag.h:123: error: 's' was not declared in this scope
/home/amarok-dev/multimedia/amarok/src/metadata/audible/audibletag.h: At global scope:
/home/amarok-dev/multimedia/amarok/src/metadata/audible/audibletag.h:123: warning: unused parameter 'String'
/home/amarok-dev/multimedia/amarok/src/metadata/audible/audibletag.h: In member function 'virtual void TagLib::Audible::Tag::setGenre(int)':
/home/amarok-dev/multimedia/amarok/src/metadata/audible/audibletag.h:132: error: 'm_genre' was not declared in this scope
/home/amarok-dev/multimedia/amarok/src/metadata/audible/audibletag.h:132: error: 's' was not declared in this scope
/home/amarok-dev/multimedia/amarok/src/metadata/audible/audibletag.h: At global scope:
/home/amarok-dev/multimedia/amarok/src/metadata/audible/audibletag.h:132: warning: unused parameter 'String'
/home/amarok-dev/multimedia/amarok/src/metadata/audible/taglib_audiblefile.h:40: error: expected class-name before '{' token
/home/amarok-dev/multimedia/amarok/src/metadata/audible/taglib_audiblefile.h:48: error: 'class TagLib::Audible::Properties::ReadStyle' has not been declared
/home/amarok-dev/multimedia/amarok/src/metadata/audible/taglib_audiblefile.h:73: error: 'class TagLib::Audible::Properties::ReadStyle' has not been declared
/home/amarok-dev/multimedia/amarok/src/metadata/audible/taglib_audiblefile.h:48: error: 'Average' is not a member of 'TagLib::Audible::Properties'
/home/amarok-dev/multimedia/amarok/src/metadata/wav/wavfiletyperesolver.h:29: error: 'TagLib::FileRef' has not been declared
/home/amarok-dev/multimedia/amarok/src/metadata/wav/wavfiletyperesolver.h:29: error: expected `{' before 'FileTypeResolver'
/home/amarok-dev/multimedia/amarok/src/metadata/wav/wavfiletyperesolver.h:29: error: invalid function declaration
/home/amarok-dev/multimedia/amarok/src/metadata/wav/wavproperties.h:46: error: expected class-name before '{' token
/home/amarok-dev/multimedia/amarok/src/metadata/wav/wavproperties.h:51: error: expected `)' before 'style'
/home/amarok-dev/multimedia/amarok/src/metadata/wav/wavfile.h:39: error: expected class-name before '{' token
/home/amarok-dev/multimedia/amarok/src/metadata/wav/wavfile.h:47: error: 'class TagLib::Wav::Properties::ReadStyle' has not been declared
/home/amarok-dev/multimedia/amarok/src/metadata/wav/wavfile.h:72: error: 'class TagLib::Wav::Properties::ReadStyle' has not been declared
/home/amarok-dev/multimedia/amarok/src/metadata/wav/wavfile.h:47: error: 'Average' is not a member of 'TagLib::Wav::Properties'
/home/amarok-dev/multimedia/amarok/src/metadata/aac/aacfiletyperesolver.h:29: error: 'TagLib::FileRef' has not been declared
/home/amarok-dev/multimedia/amarok/src/metadata/aac/aacfiletyperesolver.h:29: error: expected `{' before 'FileTypeResolver'
/home/amarok-dev/multimedia/amarok/src/metadata/aac/aacfiletyperesolver.h:29: error: invalid function declaration
/home/amarok-dev/multimedia/amarok/src/metadata/tplugins.cpp: In function 'void registerTaglibPlugins()':
/home/amarok-dev/multimedia/amarok/src/metadata/tplugins.cpp:133: error: 'TagLib::FileRef' has not been declared
/home/amarok-dev/multimedia/amarok/src/metadata/tplugins.cpp:133: error: invalid type in declaration before '(' token
/home/amarok-dev/multimedia/amarok/src/metadata/tplugins.cpp:133: error: invalid use of undefined type 'class MP4FileTypeResolver'
/home/amarok-dev/multimedia/amarok/src/metadata/mp4/taglib_mp4filetyperesolver.h:32: error: forward declaration of 'class MP4FileTypeResolver'
/home/amarok-dev/multimedia/amarok/src/metadata/tplugins.cpp:134: error: 'TagLib::FileRef' has not been declared
/home/amarok-dev/multimedia/amarok/src/metadata/tplugins.cpp:134: error: invalid type in declaration before '(' token
/home/amarok-dev/multimedia/amarok/src/metadata/tplugins.cpp:134: error: redeclaration of 'int addFileTypeResolver'
/home/amarok-dev/multimedia/amarok/src/metadata/tplugins.cpp:133: error: 'int addFileTypeResolver' previously declared here
/home/amarok-dev/multimedia/amarok/src/metadata/tplugins.cpp:134: error: invalid use of undefined type 'class WMAFileTypeResolver'
/home/amarok-dev/multimedia/amarok/src/metadata/wma/taglib_wmafiletyperesolver.h:32: error: forward declaration of 'class WMAFileTypeResolver'
/home/amarok-dev/multimedia/amarok/src/metadata/tplugins.cpp:135: error: 'TagLib::FileRef' has not been declared
/home/amarok-dev/multimedia/amarok/src/metadata/tplugins.cpp:135: error: invalid type in declaration before '(' token
/home/amarok-dev/multimedia/amarok/src/metadata/tplugins.cpp:135: error: redeclaration of 'int addFileTypeResolver'
/home/amarok-dev/multimedia/amarok/src/metadata/tplugins.cpp:133: error: 'int addFileTypeResolver' previously declared here
/home/amarok-dev/multimedia/amarok/src/metadata/tplugins.cpp:135: error: invalid use of undefined type 'class RealMediaFileTypeResolver'
/home/amarok-dev/multimedia/amarok/src/metadata/rmff/taglib_realmediafiletyperesolver.h:32: error: forward declaration of 'class RealMediaFileTypeResolver'
/home/amarok-dev/multimedia/amarok/src/metadata/tplugins.cpp:136: error: 'TagLib::FileRef' has not been declared
/home/amarok-dev/multimedia/amarok/src/metadata/tplugins.cpp:136: error: invalid type in declaration before '(' token
/home/amarok-dev/multimedia/amarok/src/metadata/tplugins.cpp:136: error: redeclaration of 'int addFileTypeResolver'
/home/amarok-dev/multimedia/amarok/src/metadata/tplugins.cpp:133: error: 'int addFileTypeResolver' previously declared here
/home/amarok-dev/multimedia/amarok/src/metadata/tplugins.cpp:136: error: invalid use of undefined type 'class AudibleFileTypeResolver'
/home/amarok-dev/multimedia/amarok/src/metadata/audible/taglib_audiblefiletyperesolver.h:29: error: forward declaration of 'class AudibleFileTypeResolver'
/home/amarok-dev/multimedia/amarok/src/metadata/tplugins.cpp:137: error: 'TagLib::FileRef' has not been declared
/home/amarok-dev/multimedia/amarok/src/metadata/tplugins.cpp:137: error: invalid type in declaration before '(' token
/home/amarok-dev/multimedia/amarok/src/metadata/tplugins.cpp:137: error: redeclaration of 'int addFileTypeResolver'
/home/amarok-dev/multimedia/amarok/src/metadata/tplugins.cpp:133: error: 'int addFileTypeResolver' previously declared here
/home/amarok-dev/multimedia/amarok/src/metadata/tplugins.cpp:137: error: invalid use of undefined type 'class AACFileTypeResolver'
/home/amarok-dev/multimedia/amarok/src/metadata/aac/aacfiletyperesolver.h:29: error: forward declaration of 'class AACFileTypeResolver'
/home/amarok-dev/multimedia/amarok/src/metadata/tplugins.cpp:138: error: 'TagLib::FileRef' has not been declared
/home/amarok-dev/multimedia/amarok/src/metadata/tplugins.cpp:138: error: invalid type in declaration before '(' token
/home/amarok-dev/multimedia/amarok/src/metadata/tplugins.cpp:138: error: redeclaration of 'int addFileTypeResolver'
/home/amarok-dev/multimedia/amarok/src/metadata/tplugins.cpp:133: error: 'int addFileTypeResolver' previously declared here
/home/amarok-dev/multimedia/amarok/src/metadata/tplugins.cpp:138: error: invalid use of undefined type 'class WavPackFileTypeResolver'
/home/amarok-dev/multimedia/amarok/src/metadata/wavpack/taglib_wavpackfiletyperesolver.h:29: error: forward declaration of 'class WavPackFileTypeResolver'
/home/amarok-dev/multimedia/amarok/src/metadata/tplugins.cpp:139: error: 'TagLib::FileRef' has not been declared
/home/amarok-dev/multimedia/amarok/src/metadata/tplugins.cpp:139: error: invalid type in declaration before '(' token
/home/amarok-dev/multimedia/amarok/src/metadata/tplugins.cpp:139: error: redeclaration of 'int addFileTypeResolver'
/home/amarok-dev/multimedia/amarok/src/metadata/tplugins.cpp:133: error: 'int addFileTypeResolver' previously declared here
/home/amarok-dev/multimedia/amarok/src/metadata/tplugins.cpp:139: error: invalid use of undefined type 'class SpeexFileTypeResolver'
/home/amarok-dev/multimedia/amarok/src/metadata/speex/taglib_speexfiletyperesolver.h:29: error: forward declaration of 'class SpeexFileTypeResolver'
/home/amarok-dev/multimedia/amarok/src/metadata/tplugins.cpp:140: error: 'TagLib::FileRef' has not been declared
/home/amarok-dev/multimedia/amarok/src/metadata/tplugins.cpp:140: error: invalid type in declaration before '(' token
/home/amarok-dev/multimedia/amarok/src/metadata/tplugins.cpp:140: error: redeclaration of 'int addFileTypeResolver'
/home/amarok-dev/multimedia/amarok/src/metadata/tplugins.cpp:133: error: 'int addFileTypeResolver' previously declared here
/home/amarok-dev/multimedia/amarok/src/metadata/tplugins.cpp:140: error: invalid use of undefined type 'class TTAFileTypeResolver'
/home/amarok-dev/multimedia/amarok/src/metadata/trueaudio/taglib_trueaudiofiletyperesolver.h:29: error: forward declaration of 'class TTAFileTypeResolver'
/home/amarok-dev/multimedia/amarok/src/metadata/tplugins.cpp:141: error: 'TagLib::FileRef' has not been declared
/home/amarok-dev/multimedia/amarok/src/metadata/tplugins.cpp:141: error: invalid type in declaration before '(' token
/home/amarok-dev/multimedia/amarok/src/metadata/tplugins.cpp:141: error: redeclaration of 'int addFileTypeResolver'
/home/amarok-dev/multimedia/amarok/src/metadata/tplugins.cpp:133: error: 'int addFileTypeResolver' previously declared here
/home/amarok-dev/multimedia/amarok/src/metadata/tplugins.cpp:141: error: invalid use of undefined type 'class WavFileTypeResolver'
/home/amarok-dev/multimedia/amarok/src/metadata/wav/wavfiletyperesolver.h:29: error: forward declaration of 'class WavFileTypeResolver'
/home/amarok-dev/multimedia/amarok/src/metadata/tplugins.cpp:133: warning: unused variable 'addFileTypeResolver'
make[2]: *** [amarok/src/metadata/CMakeFiles/amarok_taglib.dir/tplugins.o] Error 1
make[2]: Leaving directory `/home/amarok-dev/amarok-build'
make[1]: *** [amarok/src/metadata/CMakeFiles/amarok_taglib.dir/all] Error 2
make[1]: Leaving directory `/home/amarok-dev/amarok-build'
make: *** [all] Error 2