All pastes #462908 Raw Edit

Untitled

public text v1 · immutable
#462908 ·published 2007-04-28 16:50 UTC
rendered paste body
>>> Emerging (1 of 1) x11-drivers/ati-drivers-8.32.5 to /
 * ati-driver-installer-8.32.5-x86.x86_64.run RMD160 ;-) ...                                                                                                                                     [ ok ]
 * ati-driver-installer-8.32.5-x86.x86_64.run SHA1 ;-) ...                                                                                                                                       [ ok ]
 * ati-driver-installer-8.32.5-x86.x86_64.run SHA256 ;-) ...                                                                                                                                     [ ok ]
 * ati-driver-installer-8.32.5-x86.x86_64.run size ;-) ...                                                                                                                                       [ ok ]
 * checking ebuild checksums ;-) ...                                                                                                                                                             [ ok ]
 * checking auxfile checksums ;-) ...                                                                                                                                                            [ ok ]
 * checking miscfile checksums ;-) ...                                                                                                                                                           [ ok ]
 * checking ati-driver-installer-8.32.5-x86.x86_64.run ;-) ...                                                                                                                                   [ ok ]
 * Determining the location of the kernel source code
 * Found kernel source directory:
 *     /usr/src/linux
 * Found kernel object directory:
 *     /lib/modules/2.6.20-gentoo-r7/build
 * Found sources for kernel version:
 *     2.6.20-gentoo-r7
 * X11 implementation is xorg-x11.
>>> Unpacking source...
 * Unpacking Ati drivers ...                                                                                                                                                                     [ ok ]
 * Applying ati-drivers-2.6.19.patch ...                                                                                                                                                         [ ok ]
 * Applying ati-powermode.sh.patch ...                                                                                                                                                           [ ok ]
>>> Source unpacked.
>>> Compiling source in /var/tmp/portage/x11-drivers/ati-drivers-8.32.5/work/common/lib/modules/fglrx/build_mod ...
 * Building the DRM module...
 * Converting Makefile to use M= instead of SUBDIRS= ...                                                                                                                                         [ ok ]
 * Preparing fglrx module
make -C /usr/src/linux M=/var/tmp/portage/x11-drivers/ati-drivers-8.32.5/work/common/lib/modules/fglrx/build_mod modules
make[1]: entrant dans le répertoire « /usr/src/linux-2.6.20-gentoo-r7 »
  CC [M]  /var/tmp/portage/x11-drivers/ati-drivers-8.32.5/work/common/lib/modules/fglrx/build_mod/firegl_public.o
/var/tmp/portage/x11-drivers/ati-drivers-8.32.5/work/common/lib/modules/fglrx/build_mod/firegl_public.c:185: erreur: expected declaration specifiers or '...' before 'mlock'
/var/tmp/portage/x11-drivers/ati-drivers-8.32.5/work/common/lib/modules/fglrx/build_mod/firegl_public.c:185: erreur: expected declaration specifiers or '...' before 'addr'
/var/tmp/portage/x11-drivers/ati-drivers-8.32.5/work/common/lib/modules/fglrx/build_mod/firegl_public.c:185: erreur: expected declaration specifiers or '...' before 'len'
/var/tmp/portage/x11-drivers/ati-drivers-8.32.5/work/common/lib/modules/fglrx/build_mod/firegl_public.c:187: attention : return type defaults to 'int'
/var/tmp/portage/x11-drivers/ati-drivers-8.32.5/work/common/lib/modules/fglrx/build_mod/firegl_public.c: In function '_syscall2':
/var/tmp/portage/x11-drivers/ati-drivers-8.32.5/work/common/lib/modules/fglrx/build_mod/firegl_public.c:187: erreur: expected declaration specifiers before '_syscall2'
/var/tmp/portage/x11-drivers/ati-drivers-8.32.5/work/common/lib/modules/fglrx/build_mod/firegl_public.c:220: erreur: parameter '__ke_debuglevel' is initialized
/var/tmp/portage/x11-drivers/ati-drivers-8.32.5/work/common/lib/modules/fglrx/build_mod/firegl_public.c:221: erreur: parameter '__ke_moduleflags' is initialized
/var/tmp/portage/x11-drivers/ati-drivers-8.32.5/work/common/lib/modules/fglrx/build_mod/firegl_public.c:224: erreur: storage class specified for parameter '__mod_author224'
/var/tmp/portage/x11-drivers/ati-drivers-8.32.5/work/common/lib/modules/fglrx/build_mod/firegl_public.c:224: erreur: parameter '__mod_author224' is initialized
/var/tmp/portage/x11-drivers/ati-drivers-8.32.5/work/common/lib/modules/fglrx/build_mod/firegl_public.c:224: attention : '__used__' attribute ignored
/var/tmp/portage/x11-drivers/ati-drivers-8.32.5/work/common/lib/modules/fglrx/build_mod/firegl_public.c:224: erreur: section attribute not allowed for '__mod_author224'
/var/tmp/portage/x11-drivers/ati-drivers-8.32.5/work/common/lib/modules/fglrx/build_mod/firegl_public.c:225: erreur: storage class specified for parameter '__mod_description225'
/var/tmp/portage/x11-drivers/ati-drivers-8.32.5/work/common/lib/modules/fglrx/build_mod/firegl_public.c:225: erreur: parameter '__mod_description225' is initialized
/var/tmp/portage/x11-drivers/ati-drivers-8.32.5/work/common/lib/modules/fglrx/build_mod/firegl_public.c:225: attention : '__used__' attribute ignored
/var/tmp/portage/x11-drivers/ati-drivers-8.32.5/work/common/lib/modules/fglrx/build_mod/firegl_public.c:225: erreur: section attribute not allowed for '__mod_description225'
/var/tmp/portage/x11-drivers/ati-drivers-8.32.5/work/common/lib/modules/fglrx/build_mod/firegl_public.c:229: erreur: expected '=', ',', ';', 'asm' or '__attribute__' before '{' token
/var/tmp/portage/x11-drivers/ati-drivers-8.32.5/work/common/lib/modules/fglrx/build_mod/firegl_public.c:229: erreur: expected declaration specifiers before ';' token
/var/tmp/portage/x11-drivers/ati-drivers-8.32.5/work/common/lib/modules/fglrx/build_mod/firegl_public.c:229: erreur: storage class specified for parameter '__param_perm_check_firegl'
/var/tmp/portage/x11-drivers/ati-drivers-8.32.5/work/common/lib/modules/fglrx/build_mod/firegl_public.c:229: erreur: parameter '__param_perm_check_firegl' is initialized
/var/tmp/portage/x11-drivers/ati-drivers-8.32.5/work/common/lib/modules/fglrx/build_mod/firegl_public.c:229: erreur: storage class specified for parameter '__param_str_firegl'
/var/tmp/portage/x11-drivers/ati-drivers-8.32.5/work/common/lib/modules/fglrx/build_mod/firegl_public.c:229: erreur: parameter '__param_str_firegl' is initialized
/var/tmp/portage/x11-drivers/ati-drivers-8.32.5/work/common/lib/modules/fglrx/build_mod/firegl_public.c:229: erreur: storage class specified for parameter '__param_firegl'
/var/tmp/portage/x11-drivers/ati-drivers-8.32.5/work/common/lib/modules/fglrx/build_mod/firegl_public.c:229: erreur: parameter '__param_firegl' is initialized
/var/tmp/portage/x11-drivers/ati-drivers-8.32.5/work/common/lib/modules/fglrx/build_mod/firegl_public.c:229: attention : '__used__' attribute ignored
/var/tmp/portage/x11-drivers/ati-drivers-8.32.5/work/common/lib/modules/fglrx/build_mod/firegl_public.c:229: erreur: section attribute not allowed for '__param_firegl'
/var/tmp/portage/x11-drivers/ati-drivers-8.32.5/work/common/lib/modules/fglrx/build_mod/firegl_public.c:229: erreur: alignment may not be specified for '__param_firegl'
/var/tmp/portage/x11-drivers/ati-drivers-8.32.5/work/common/lib/modules/fglrx/build_mod/firegl_public.c:229: erreur: 'firegl' undeclared (first use in this function)
/var/tmp/portage/x11-drivers/ati-drivers-8.32.5/work/common/lib/modules/fglrx/build_mod/firegl_public.c:229: erreur: (Each undeclared identifier is reported only once
/var/tmp/portage/x11-drivers/ati-drivers-8.32.5/work/common/lib/modules/fglrx/build_mod/firegl_public.c:229: erreur: for each function it appears in.)
/var/tmp/portage/x11-drivers/ati-drivers-8.32.5/work/common/lib/modules/fglrx/build_mod/firegl_public.c:229: erreur: storage class specified for parameter '__mod_firegltype229'
/var/tmp/portage/x11-drivers/ati-drivers-8.32.5/work/common/lib/modules/fglrx/build_mod/firegl_public.c:229: erreur: parameter '__mod_firegltype229' is initialized
/var/tmp/portage/x11-drivers/ati-drivers-8.32.5/work/common/lib/modules/fglrx/build_mod/firegl_public.c:229: attention : '__used__' attribute ignored
/var/tmp/portage/x11-drivers/ati-drivers-8.32.5/work/common/lib/modules/fglrx/build_mod/firegl_public.c:229: erreur: section attribute not allowed for '__mod_firegltype229'
/var/tmp/portage/x11-drivers/ati-drivers-8.32.5/work/common/lib/modules/fglrx/build_mod/firegl_public.c:232: erreur: storage class specified for parameter '__mod_license232'
/var/tmp/portage/x11-drivers/ati-drivers-8.32.5/work/common/lib/modules/fglrx/build_mod/firegl_public.c:232: erreur: parameter '__mod_license232' is initialized
/var/tmp/portage/x11-drivers/ati-drivers-8.32.5/work/common/lib/modules/fglrx/build_mod/firegl_public.c:232: attention : '__used__' attribute ignored
/var/tmp/portage/x11-drivers/ati-drivers-8.32.5/work/common/lib/modules/fglrx/build_mod/firegl_public.c:232: erreur: section attribute not allowed for '__mod_license232'
/var/tmp/portage/x11-drivers/ati-drivers-8.32.5/work/common/lib/modules/fglrx/build_mod/firegl_public.c:238: erreur: parameter '__ke_UTS_RELEASE' is initialized
/var/tmp/portage/x11-drivers/ati-drivers-8.32.5/work/common/lib/modules/fglrx/build_mod/firegl_public.c:239: erreur: parameter '__ke_PAGE_SHIFT' is initialized
/var/tmp/portage/x11-drivers/ati-drivers-8.32.5/work/common/lib/modules/fglrx/build_mod/firegl_public.c:240: erreur: parameter '__ke_PAGE_SIZE' is initialized
/var/tmp/portage/x11-drivers/ati-drivers-8.32.5/work/common/lib/modules/fglrx/build_mod/firegl_public.c:241: erreur: parameter '__ke_PAGE_MASK' is initialized
/var/tmp/portage/x11-drivers/ati-drivers-8.32.5/work/common/lib/modules/fglrx/build_mod/firegl_public.c:242: erreur: parameter '__ke_LINUX_VERSION_CODE' is initialized
/var/tmp/portage/x11-drivers/ati-drivers-8.32.5/work/common/lib/modules/fglrx/build_mod/firegl_public.c:249: erreur: parameter '__ke_MODVERSIONS_State' is initialized
/var/tmp/portage/x11-drivers/ati-drivers-8.32.5/work/common/lib/modules/fglrx/build_mod/firegl_public.c:257: erreur: parameter '__ke_SMP_State' is initialized
/var/tmp/portage/x11-drivers/ati-drivers-8.32.5/work/common/lib/modules/fglrx/build_mod/firegl_public.c:265: erreur: parameter '__ke_PAE_State' is initialized
/var/tmp/portage/x11-drivers/ati-drivers-8.32.5/work/common/lib/modules/fglrx/build_mod/firegl_public.c:274: erreur: expected '=', ',', ';', 'asm' or '__attribute__' before '{' token
/var/tmp/portage/x11-drivers/ati-drivers-8.32.5/work/common/lib/modules/fglrx/build_mod/firegl_public.c:276: erreur: expected '=', ',', ';', 'asm' or '__attribute__' before '{' token
/var/tmp/portage/x11-drivers/ati-drivers-8.32.5/work/common/lib/modules/fglrx/build_mod/firegl_public.c:278: erreur: expected '=', ',', ';', 'asm' or '__attribute__' before '{' token
/var/tmp/portage/x11-drivers/ati-drivers-8.32.5/work/common/lib/modules/fglrx/build_mod/firegl_public.c:280: erreur: expected '=', ',', ';', 'asm' or '__attribute__' before '{' token
/var/tmp/portage/x11-drivers/ati-drivers-8.32.5/work/common/lib/modules/fglrx/build_mod/firegl_public.c:284: erreur: expected '=', ',', ';', 'asm' or '__attribute__' before '{' token
/var/tmp/portage/x11-drivers/ati-drivers-8.32.5/work/common/lib/modules/fglrx/build_mod/firegl_public.c:287: erreur: storage class specified for parameter 'firegl_fops'
/var/tmp/portage/x11-drivers/ati-drivers-8.32.5/work/common/lib/modules/fglrx/build_mod/firegl_public.c:287: erreur: parameter 'firegl_fops' is initialized
/var/tmp/portage/x11-drivers/ati-drivers-8.32.5/work/common/lib/modules/fglrx/build_mod/firegl_public.c:292: erreur: 'ip_firegl_open' undeclared (first use in this function)
/var/tmp/portage/x11-drivers/ati-drivers-8.32.5/work/common/lib/modules/fglrx/build_mod/firegl_public.c:293: erreur: 'ip_firegl_release' undeclared (first use in this function)
/var/tmp/portage/x11-drivers/ati-drivers-8.32.5/work/common/lib/modules/fglrx/build_mod/firegl_public.c:294: erreur: 'ip_firegl_ioctl' undeclared (first use in this function)
/var/tmp/portage/x11-drivers/ati-drivers-8.32.5/work/common/lib/modules/fglrx/build_mod/firegl_public.c:295: erreur: 'ip_firegl_mmap' undeclared (first use in this function)
/var/tmp/portage/x11-drivers/ati-drivers-8.32.5/work/common/lib/modules/fglrx/build_mod/firegl_public.c:298: erreur: 'ip_firegl_compat_ioctl' undeclared (first use in this function)
/var/tmp/portage/x11-drivers/ati-drivers-8.32.5/work/common/lib/modules/fglrx/build_mod/firegl_public.c:310: erreur: storage class specified for parameter 'device_t'
/var/tmp/portage/x11-drivers/ati-drivers-8.32.5/work/common/lib/modules/fglrx/build_mod/firegl_public.c:312: erreur: expected '=', ',', ';', 'asm' or '__attribute__' before 'firegl_public_device'
In file included from /var/tmp/portage/x11-drivers/ati-drivers-8.32.5/work/common/lib/modules/fglrx/build_mod/firegl_public.c:318:
/var/tmp/portage/x11-drivers/ati-drivers-8.32.5/work/common/lib/modules/fglrx/build_mod/drm.h:103: erreur: storage class specified for parameter 'drm_handle_t'
/var/tmp/portage/x11-drivers/ati-drivers-8.32.5/work/common/lib/modules/fglrx/build_mod/drm.h:104: erreur: storage class specified for parameter 'drm_context_t'
/var/tmp/portage/x11-drivers/ati-drivers-8.32.5/work/common/lib/modules/fglrx/build_mod/drm.h:105: erreur: storage class specified for parameter 'drm_drawable_t'
/var/tmp/portage/x11-drivers/ati-drivers-8.32.5/work/common/lib/modules/fglrx/build_mod/drm.h:106: erreur: storage class specified for parameter 'drm_magic_t'
/var/tmp/portage/x11-drivers/ati-drivers-8.32.5/work/common/lib/modules/fglrx/build_mod/drm.h:123: erreur: storage class specified for parameter 'drm_clip_rect_t'
/var/tmp/portage/x11-drivers/ati-drivers-8.32.5/work/common/lib/modules/fglrx/build_mod/drm.h:135: erreur: storage class specified for parameter 'drm_tex_region_t'
/var/tmp/portage/x11-drivers/ati-drivers-8.32.5/work/common/lib/modules/fglrx/build_mod/drm.h:147: erreur: storage class specified for parameter 'drm_hw_lock_t'
/var/tmp/portage/x11-drivers/ati-drivers-8.32.5/work/common/lib/modules/fglrx/build_mod/drm.h:181: erreur: storage class specified for parameter 'drm_version_t'
/var/tmp/portage/x11-drivers/ati-drivers-8.32.5/work/common/lib/modules/fglrx/build_mod/drm.h:192: erreur: storage class specified for parameter 'drm_unique_t'
/var/tmp/portage/x11-drivers/ati-drivers-8.32.5/work/common/lib/modules/fglrx/build_mod/drm.h:198: erreur: expected specifier-qualifier-list before 'drm_version_t'
/var/tmp/portage/x11-drivers/ati-drivers-8.32.5/work/common/lib/modules/fglrx/build_mod/drm.h:199: erreur: storage class specified for parameter 'drm_list_t'
/var/tmp/portage/x11-drivers/ati-drivers-8.32.5/work/common/lib/modules/fglrx/build_mod/drm.h:204: erreur: storage class specified for parameter 'drm_block_t'
/var/tmp/portage/x11-drivers/ati-drivers-8.32.5/work/common/lib/modules/fglrx/build_mod/drm.h:220: erreur: storage class specified for parameter 'drm_control_t'
/var/tmp/portage/x11-drivers/ati-drivers-8.32.5/work/common/lib/modules/fglrx/build_mod/drm.h:232: erreur: storage class specified for parameter 'drm_map_type_t'
/var/tmp/portage/x11-drivers/ati-drivers-8.32.5/work/common/lib/modules/fglrx/build_mod/drm.h:246: erreur: storage class specified for parameter 'drm_map_flags_t'
/var/tmp/portage/x11-drivers/ati-drivers-8.32.5/work/common/lib/modules/fglrx/build_mod/drm.h:252: erreur: storage class specified for parameter 'drm_ctx_priv_map_t'
/var/tmp/portage/x11-drivers/ati-drivers-8.32.5/work/common/lib/modules/fglrx/build_mod/drm.h:264: erreur: expected specifier-qualifier-list before 'drm_map_type_t'
/var/tmp/portage/x11-drivers/ati-drivers-8.32.5/work/common/lib/modules/fglrx/build_mod/drm.h:270: erreur: storage class specified for parameter 'drm_map_t'
/var/tmp/portage/x11-drivers/ati-drivers-8.32.5/work/common/lib/modules/fglrx/build_mod/drm.h:283: erreur: storage class specified for parameter 'drm_client_t'
/var/tmp/portage/x11-drivers/ati-drivers-8.32.5/work/common/lib/modules/fglrx/build_mod/drm.h:305: erreur: storage class specified for parameter 'drm_stat_type_t'
/var/tmp/portage/x11-drivers/ati-drivers-8.32.5/work/common/lib/modules/fglrx/build_mod/drm.h:315: erreur: expected specifier-qualifier-list before 'drm_stat_type_t'
/var/tmp/portage/x11-drivers/ati-drivers-8.32.5/work/common/lib/modules/fglrx/build_mod/drm.h:317: erreur: storage class specified for parameter 'drm_stats_t'
/var/tmp/portage/x11-drivers/ati-drivers-8.32.5/work/common/lib/modules/fglrx/build_mod/drm.h:333: erreur: storage class specified for parameter 'drm_lock_flags_t'
/var/tmp/portage/x11-drivers/ati-drivers-8.32.5/work/common/lib/modules/fglrx/build_mod/drm.h:343: erreur: expected specifier-qualifier-list before 'drm_lock_flags_t'
/var/tmp/portage/x11-drivers/ati-drivers-8.32.5/work/common/lib/modules/fglrx/build_mod/drm.h:344: erreur: storage class specified for parameter 'drm_lock_t'
/var/tmp/portage/x11-drivers/ati-drivers-8.32.5/work/common/lib/modules/fglrx/build_mod/drm.h:374: erreur: storage class specified for parameter 'drm_dma_flags_t'
/var/tmp/portage/x11-drivers/ati-drivers-8.32.5/work/common/lib/modules/fglrx/build_mod/drm.h:396: erreur: storage class specified for parameter 'drm_buf_desc_t'
/var/tmp/portage/x11-drivers/ati-drivers-8.32.5/work/common/lib/modules/fglrx/build_mod/drm.h:404: erreur: expected specifier-qualifier-list before 'drm_buf_desc_t'
/var/tmp/portage/x11-drivers/ati-drivers-8.32.5/work/common/lib/modules/fglrx/build_mod/drm.h:405: erreur: storage class specified for parameter 'drm_buf_info_t'
/var/tmp/portage/x11-drivers/ati-drivers-8.32.5/work/common/lib/modules/fglrx/build_mod/drm.h:414: erreur: storage class specified for parameter 'drm_buf_free_t'
/var/tmp/portage/x11-drivers/ati-drivers-8.32.5/work/common/lib/modules/fglrx/build_mod/drm.h:427: erreur: storage class specified for parameter 'drm_buf_pub_t'
/var/tmp/portage/x11-drivers/ati-drivers-8.32.5/work/common/lib/modules/fglrx/build_mod/drm.h:436: erreur: expected specifier-qualifier-list before 'drm_buf_pub_t'
/var/tmp/portage/x11-drivers/ati-drivers-8.32.5/work/common/lib/modules/fglrx/build_mod/drm.h:437: erreur: storage class specified for parameter 'drm_buf_map_t'
/var/tmp/portage/x11-drivers/ati-drivers-8.32.5/work/common/lib/modules/fglrx/build_mod/drm.h:452: erreur: expected specifier-qualifier-list before 'drm_dma_flags_t'
/var/tmp/portage/x11-drivers/ati-drivers-8.32.5/work/common/lib/modules/fglrx/build_mod/drm.h:458: erreur: storage class specified for parameter 'drm_dma_t'
/var/tmp/portage/x11-drivers/ati-drivers-8.32.5/work/common/lib/modules/fglrx/build_mod/drm.h:464: erreur: storage class specified for parameter 'drm_ctx_flags_t'
/var/tmp/portage/x11-drivers/ati-drivers-8.32.5/work/common/lib/modules/fglrx/build_mod/drm.h:473: erreur: expected specifier-qualifier-list before 'drm_context_t'
/var/tmp/portage/x11-drivers/ati-drivers-8.32.5/work/common/lib/modules/fglrx/build_mod/drm.h:475: erreur: storage class specified for parameter 'drm_ctx_t'
/var/tmp/portage/x11-drivers/ati-drivers-8.32.5/work/common/lib/modules/fglrx/build_mod/drm.h:483: erreur: expected specifier-qualifier-list before 'drm_ctx_t'
/var/tmp/portage/x11-drivers/ati-drivers-8.32.5/work/common/lib/modules/fglrx/build_mod/drm.h:484: erreur: storage class specified for parameter 'drm_ctx_res_t'
/var/tmp/portage/x11-drivers/ati-drivers-8.32.5/work/common/lib/modules/fglrx/build_mod/drm.h:491: erreur: expected specifier-qualifier-list before 'drm_drawable_t'
/var/tmp/portage/x11-drivers/ati-drivers-8.32.5/work/common/lib/modules/fglrx/build_mod/drm.h:492: erreur: storage class specified for parameter 'drm_draw_t'
/var/tmp/portage/x11-drivers/ati-drivers-8.32.5/work/common/lib/modules/fglrx/build_mod/drm.h:499: erreur: expected specifier-qualifier-list before 'drm_magic_t'
/var/tmp/portage/x11-drivers/ati-drivers-8.32.5/work/common/lib/modules/fglrx/build_mod/drm.h:500: erreur: storage class specified for parameter 'drm_auth_t'
/var/tmp/portage/x11-drivers/ati-drivers-8.32.5/work/common/lib/modules/fglrx/build_mod/drm.h:513: erreur: storage class specified for parameter 'drm_irq_busid_t'
/var/tmp/portage/x11-drivers/ati-drivers-8.32.5/work/common/lib/modules/fglrx/build_mod/drm.h:520: erreur: storage class specified for parameter 'drm_vblank_seq_type_t'
/var/tmp/portage/x11-drivers/ati-drivers-8.32.5/work/common/lib/modules/fglrx/build_mod/drm.h:527: erreur: expected specifier-qualifier-list before 'drm_vblank_seq_type_t'
/var/tmp/portage/x11-drivers/ati-drivers-8.32.5/work/common/lib/modules/fglrx/build_mod/drm.h:530: attention : déclaration vide
/var/tmp/portage/x11-drivers/ati-drivers-8.32.5/work/common/lib/modules/fglrx/build_mod/drm.h:534: erreur: expected specifier-qualifier-list before 'drm_vblank_seq_type_t'
/var/tmp/portage/x11-drivers/ati-drivers-8.32.5/work/common/lib/modules/fglrx/build_mod/drm.h:538: attention : déclaration vide
/var/tmp/portage/x11-drivers/ati-drivers-8.32.5/work/common/lib/modules/fglrx/build_mod/drm.h:549: erreur: storage class specified for parameter 'drm_wait_vblank_t'
/var/tmp/portage/x11-drivers/ati-drivers-8.32.5/work/common/lib/modules/fglrx/build_mod/drm.h:559: erreur: storage class specified for parameter 'drm_agp_mode_t'
/var/tmp/portage/x11-drivers/ati-drivers-8.32.5/work/common/lib/modules/fglrx/build_mod/drm.h:572: erreur: storage class specified for parameter 'drm_agp_buffer_t'
/var/tmp/portage/x11-drivers/ati-drivers-8.32.5/work/common/lib/modules/fglrx/build_mod/drm.h:583: erreur: storage class specified for parameter 'drm_agp_binding_t'
/var/tmp/portage/x11-drivers/ati-drivers-8.32.5/work/common/lib/modules/fglrx/build_mod/drm.h:605: erreur: storage class specified for parameter 'drm_agp_info_t'
/var/tmp/portage/x11-drivers/ati-drivers-8.32.5/work/common/lib/modules/fglrx/build_mod/drm.h:614: erreur: storage class specified for parameter 'drm_scatter_gather_t'
/var/tmp/portage/x11-drivers/ati-drivers-8.32.5/work/common/lib/modules/fglrx/build_mod/drm.h:624: erreur: storage class specified for parameter 'drm_set_version_t'
/var/tmp/portage/x11-drivers/ati-drivers-8.32.5/work/common/lib/modules/fglrx/build_mod/firegl_public.c:324: erreur: expected '=', ',', ';', 'asm' or '__attribute__' before '{' token
In file included from include/linux/poll.h:4,
                 from /var/tmp/portage/x11-drivers/ati-drivers-8.32.5/work/common/lib/modules/fglrx/build_mod/drmP.h:81,
                 from /var/tmp/portage/x11-drivers/ati-drivers-8.32.5/work/common/lib/modules/fglrx/build_mod/drm_proc.h:41,
                 from /var/tmp/portage/x11-drivers/ati-drivers-8.32.5/work/common/lib/modules/fglrx/build_mod/firegl_public.c:334:
include/asm/poll.h:25: attention : déclaration vide
In file included from /var/tmp/portage/x11-drivers/ati-drivers-8.32.5/work/common/lib/modules/fglrx/build_mod/drmP.h:81,
                 from /var/tmp/portage/x11-drivers/ati-drivers-8.32.5/work/common/lib/modules/fglrx/build_mod/drm_proc.h:41,
                 from /var/tmp/portage/x11-drivers/ati-drivers-8.32.5/work/common/lib/modules/fglrx/build_mod/firegl_public.c:334:
include/linux/poll.h:24: attention : déclaration vide
include/linux/poll.h:29: erreur: storage class specified for parameter 'poll_queue_proc'
include/linux/poll.h:32: erreur: expected specifier-qualifier-list before 'poll_queue_proc'
include/linux/poll.h:33: erreur: storage class specified for parameter 'poll_table'
include/linux/poll.h:35: erreur: expected declaration specifiers or '...' before 'poll_table'
include/linux/poll.h:36: erreur: expected '=', ',', ';', 'asm' or '__attribute__' before '{' token
include/linux/poll.h:41: erreur: expected ')' before '*' token
include/linux/poll.h:50: attention : déclaration vide
include/linux/poll.h:56: erreur: expected specifier-qualifier-list before 'poll_table'
include/linux/poll.h:61: attention : déclaration vide
include/linux/poll.h:63: erreur: storage class specified for parameter 'poll_initwait'
include/linux/poll.h:64: erreur: storage class specified for parameter 'poll_freewait'
include/linux/poll.h:73: erreur: storage class specified for parameter 'fd_set_bits'
include/linux/poll.h:90: erreur: expected '=', ',', ';', 'asm' or '__attribute__' before '{' token
include/linux/poll.h:101: erreur: expected '=', ',', ';', 'asm' or '__attribute__' before '{' token
include/linux/poll.h:109: erreur: expected '=', ',', ';', 'asm' or '__attribute__' before '{' token
include/linux/poll.h:115: erreur: expected declaration specifiers or '...' before 'fd_set_bits'
include/linux/poll.h:115: erreur: storage class specified for parameter 'do_select'
include/linux/poll.h:117: erreur: storage class specified for parameter 'do_sys_poll'
In file included from /var/tmp/portage/x11-drivers/ati-drivers-8.32.5/work/common/lib/modules/fglrx/build_mod/drmP.h:82,
                 from /var/tmp/portage/x11-drivers/ati-drivers-8.32.5/work/common/lib/modules/fglrx/build_mod/drm_proc.h:41,
                 from /var/tmp/portage/x11-drivers/ati-drivers-8.32.5/work/common/lib/modules/fglrx/build_mod/firegl_public.c:334:
include/asm/pgalloc.h:17: erreur: expected '=', ',', ';', 'asm' or '__attribute__' before '{' token
include/asm/pgalloc.h:22: erreur: expected '=', ',', ';', 'asm' or '__attribute__' before '{' token
include/asm/pgalloc.h:27: erreur: expected '=', ',', ';', 'asm' or '__attribute__' before '{' token
include/asm/pgalloc.h:33: erreur: expected '=', ',', ';', 'asm' or '__attribute__' before '{' token
include/asm/pgalloc.h:38: erreur: expected '=', ',', ';', 'asm' or '__attribute__' before '{' token
include/asm/pgalloc.h:43: erreur: expected '=', ',', ';', 'asm' or '__attribute__' before '{' token
include/asm/pgalloc.h:49: erreur: expected '=', ',', ';', 'asm' or '__attribute__' before '{' token
include/asm/pgalloc.h:62: erreur: expected '=', ',', ';', 'asm' or '__attribute__' before '{' token
include/asm/pgalloc.h:75: erreur: expected '=', ',', ';', 'asm' or '__attribute__' before '{' token
include/asm/pgalloc.h:95: erreur: expected '=', ',', ';', 'asm' or '__attribute__' before '{' token
include/asm/pgalloc.h:102: erreur: expected '=', ',', ';', 'asm' or '__attribute__' before '{' token
include/asm/pgalloc.h:107: erreur: expected '=', ',', ';', 'asm' or '__attribute__' before '{' token
include/asm/pgalloc.h:118: erreur: expected '=', ',', ';', 'asm' or '__attribute__' before '{' token
include/asm/pgalloc.h:124: erreur: expected '=', ',', ';', 'asm' or '__attribute__' before '{' token
In file included from /var/tmp/portage/x11-drivers/ati-drivers-8.32.5/work/common/lib/modules/fglrx/build_mod/drm_proc.h:41,
                 from /var/tmp/portage/x11-drivers/ati-drivers-8.32.5/work/common/lib/modules/fglrx/build_mod/firegl_public.c:334:
/var/tmp/portage/x11-drivers/ati-drivers-8.32.5/work/common/lib/modules/fglrx/build_mod/drmP.h:323: erreur: storage class specified for parameter 'drm_ioctl_t'
/var/tmp/portage/x11-drivers/ati-drivers-8.32.5/work/common/lib/modules/fglrx/build_mod/drmP.h:326: erreur: expected specifier-qualifier-list before 'drm_ioctl_t'
/var/tmp/portage/x11-drivers/ati-drivers-8.32.5/work/common/lib/modules/fglrx/build_mod/drmP.h:329: erreur: storage class specified for parameter 'drm_ioctl_desc_t'
/var/tmp/portage/x11-drivers/ati-drivers-8.32.5/work/common/lib/modules/fglrx/build_mod/drmP.h:333: erreur: storage class specified for parameter 'drm_devstate_t'
/var/tmp/portage/x11-drivers/ati-drivers-8.32.5/work/common/lib/modules/fglrx/build_mod/drmP.h:336: erreur: expected specifier-qualifier-list before 'drm_magic_t'
/var/tmp/portage/x11-drivers/ati-drivers-8.32.5/work/common/lib/modules/fglrx/build_mod/drmP.h:339: erreur: storage class specified for parameter 'drm_magic_entry_t'
/var/tmp/portage/x11-drivers/ati-drivers-8.32.5/work/common/lib/modules/fglrx/build_mod/drmP.h:344: erreur: storage class specified for parameter 'drm_magic_head_t'
/var/tmp/portage/x11-drivers/ati-drivers-8.32.5/work/common/lib/modules/fglrx/build_mod/drmP.h:350: erreur: storage class specified for parameter 'drm_vma_entry_t'
/var/tmp/portage/x11-drivers/ati-drivers-8.32.5/work/common/lib/modules/fglrx/build_mod/drmP.h:381: erreur: storage class specified for parameter 'drm_buf_t'
/var/tmp/portage/x11-drivers/ati-drivers-8.32.5/work/common/lib/modules/fglrx/build_mod/drmP.h:387: erreur: expected specifier-qualifier-list before 'drm_buf_t'
/var/tmp/portage/x11-drivers/ati-drivers-8.32.5/work/common/lib/modules/fglrx/build_mod/drmP.h:393: erreur: storage class specified for parameter 'drm_waitlist_t'
/var/tmp/portage/x11-drivers/ati-drivers-8.32.5/work/common/lib/modules/fglrx/build_mod/drmP.h:398: erreur: expected specifier-qualifier-list before 'drm_buf_t'
/var/tmp/portage/x11-drivers/ati-drivers-8.32.5/work/common/lib/modules/fglrx/build_mod/drmP.h:405: erreur: storage class specified for parameter 'drm_freelist_t'
/var/tmp/portage/x11-drivers/ati-drivers-8.32.5/work/common/lib/modules/fglrx/build_mod/drmP.h:413: erreur: expected specifier-qualifier-list before 'drm_buf_t'
/var/tmp/portage/x11-drivers/ati-drivers-8.32.5/work/common/lib/modules/fglrx/build_mod/drmP.h:419: erreur: storage class specified for parameter 'drm_buf_entry_t'
/var/tmp/portage/x11-drivers/ati-drivers-8.32.5/work/common/lib/modules/fglrx/build_mod/drmP.h:427: erreur: expected specifier-qualifier-list before 'drm_magic_t'
/var/tmp/portage/x11-drivers/ati-drivers-8.32.5/work/common/lib/modules/fglrx/build_mod/drmP.h:437: erreur: storage class specified for parameter 'drm_file_t'
/var/tmp/portage/x11-drivers/ati-drivers-8.32.5/work/common/lib/modules/fglrx/build_mod/drmP.h:453: erreur: expected specifier-qualifier-list before 'drm_ctx_flags_t'
/var/tmp/portage/x11-drivers/ati-drivers-8.32.5/work/common/lib/modules/fglrx/build_mod/drmP.h:456: erreur: storage class specified for parameter 'drm_queue_t'
/var/tmp/portage/x11-drivers/ati-drivers-8.32.5/work/common/lib/modules/fglrx/build_mod/drmP.h:462: erreur: expected specifier-qualifier-list before 'drm_hw_lock_t'
/var/tmp/portage/x11-drivers/ati-drivers-8.32.5/work/common/lib/modules/fglrx/build_mod/drmP.h:466: erreur: storage class specified for parameter 'drm_lock_data_t'
/var/tmp/portage/x11-drivers/ati-drivers-8.32.5/work/common/lib/modules/fglrx/build_mod/drmP.h:473: erreur: expected specifier-qualifier-list before 'drm_buf_entry_t'
/var/tmp/portage/x11-drivers/ati-drivers-8.32.5/work/common/lib/modules/fglrx/build_mod/drmP.h:492: erreur: storage class specified for parameter 'drm_device_dma_t'
/var/tmp/portage/x11-drivers/ati-drivers-8.32.5/work/common/lib/modules/fglrx/build_mod/drmP.h:534: erreur: storage class specified for parameter 'drm_sg_mem_t'
/var/tmp/portage/x11-drivers/ati-drivers-8.32.5/work/common/lib/modules/fglrx/build_mod/drmP.h:538: erreur: expected specifier-qualifier-list before 'drm_hw_lock_t'
/var/tmp/portage/x11-drivers/ati-drivers-8.32.5/work/common/lib/modules/fglrx/build_mod/drmP.h:539: erreur: storage class specified for parameter 'drm_sigdata_t'
/var/tmp/portage/x11-drivers/ati-drivers-8.32.5/work/common/lib/modules/fglrx/build_mod/drmP.h:546: erreur: expected specifier-qualifier-list before 'drm_map_t'
/var/tmp/portage/x11-drivers/ati-drivers-8.32.5/work/common/lib/modules/fglrx/build_mod/drmP.h:547: erreur: storage class specified for parameter 'drm_map_list_t'
/var/tmp/portage/x11-drivers/ati-drivers-8.32.5/work/common/lib/modules/fglrx/build_mod/drmP.h:549: erreur: expected '=', ',', ';', 'asm' or '__attribute__' before 'drm_local_map_t'
/var/tmp/portage/x11-drivers/ati-drivers-8.32.5/work/common/lib/modules/fglrx/build_mod/drmP.h:556: erreur: expected specifier-qualifier-list before 'drm_context_t'
/var/tmp/portage/x11-drivers/ati-drivers-8.32.5/work/common/lib/modules/fglrx/build_mod/drmP.h:558: erreur: storage class specified for parameter 'drm_ctx_list_t'
/var/tmp/portage/x11-drivers/ati-drivers-8.32.5/work/common/lib/modules/fglrx/build_mod/drmP.h:593: erreur: expected specifier-qualifier-list before 'drm_stat_type_t'
/var/tmp/portage/x11-drivers/ati-drivers-8.32.5/work/common/lib/modules/fglrx/build_mod/drmP.h:683: erreur: storage class specified for parameter 'drm_device_t'
/var/tmp/portage/x11-drivers/ati-drivers-8.32.5/work/common/lib/modules/fglrx/build_mod/drmP.h:691: erreur: storage class specified for parameter 'FGLDRM_flags'
/var/tmp/portage/x11-drivers/ati-drivers-8.32.5/work/common/lib/modules/fglrx/build_mod/drmP.h:692: erreur: storage class specified for parameter 'FGLDRM_parse_options'
/var/tmp/portage/x11-drivers/ati-drivers-8.32.5/work/common/lib/modules/fglrx/build_mod/drmP.h:693: erreur: storage class specified for parameter 'FGLDRM_cpu_valid'
/var/tmp/portage/x11-drivers/ati-drivers-8.32.5/work/common/lib/modules/fglrx/build_mod/drmP.h:697: erreur: storage class specified for parameter 'FGLDRM_version'
/var/tmp/portage/x11-drivers/ati-drivers-8.32.5/work/common/lib/modules/fglrx/build_mod/drmP.h:698: erreur: storage class specified for parameter 'FGLDRM_open'
/var/tmp/portage/x11-drivers/ati-drivers-8.32.5/work/common/lib/modules/fglrx/build_mod/drmP.h:699: erreur: storage class specified for parameter 'FGLDRM_release'
/var/tmp/portage/x11-drivers/ati-drivers-8.32.5/work/common/lib/modules/fglrx/build_mod/drmP.h:701: erreur: storage class specified for parameter 'FGLDRM_ioctl'
/var/tmp/portage/x11-drivers/ati-drivers-8.32.5/work/common/lib/modules/fglrx/build_mod/drmP.h:703: erreur: storage class specified for parameter 'FGLDRM_lock'
/var/tmp/portage/x11-drivers/ati-drivers-8.32.5/work/common/lib/modules/fglrx/build_mod/drmP.h:705: erreur: storage class specified for parameter 'FGLDRM_unlock'
/var/tmp/portage/x11-drivers/ati-drivers-8.32.5/work/common/lib/modules/fglrx/build_mod/drmP.h:706: erreur: storage class specified for parameter 'FGLDRM_fb_loaded'
/var/tmp/portage/x11-drivers/ati-drivers-8.32.5/work/common/lib/modules/fglrx/build_mod/drmP.h:710: erreur: expected declaration specifiers or '...' before 'drm_device_t'
/var/tmp/portage/x11-drivers/ati-drivers-8.32.5/work/common/lib/modules/fglrx/build_mod/drmP.h:710: erreur: storage class specified for parameter 'FGLDRM_open_helper'
/var/tmp/portage/x11-drivers/ati-drivers-8.32.5/work/common/lib/modules/fglrx/build_mod/drmP.h:711: erreur: storage class specified for parameter 'FGLDRM_flush'
/var/tmp/portage/x11-drivers/ati-drivers-8.32.5/work/common/lib/modules/fglrx/build_mod/drmP.h:712: erreur: storage class specified for parameter 'FGLDRM_fasync'
/var/tmp/portage/x11-drivers/ati-drivers-8.32.5/work/common/lib/modules/fglrx/build_mod/drmP.h:715: erreur: storage class specified for parameter 'FGLDRM_vm_open'
/var/tmp/portage/x11-drivers/ati-drivers-8.32.5/work/common/lib/modules/fglrx/build_mod/drmP.h:716: erreur: storage class specified for parameter 'FGLDRM_vm_close'
/var/tmp/portage/x11-drivers/ati-drivers-8.32.5/work/common/lib/modules/fglrx/build_mod/drmP.h:717: erreur: storage class specified for parameter 'FGLDRM_vm_shm_close'
/var/tmp/portage/x11-drivers/ati-drivers-8.32.5/work/common/lib/modules/fglrx/build_mod/drmP.h:719: erreur: storage class specified for parameter 'FGLDRM_mmap_dma'
/var/tmp/portage/x11-drivers/ati-drivers-8.32.5/work/common/lib/modules/fglrx/build_mod/drmP.h:720: erreur: storage class specified for parameter 'FGLDRM_mmap'
/var/tmp/portage/x11-drivers/ati-drivers-8.32.5/work/common/lib/modules/fglrx/build_mod/drmP.h:721: erreur: storage class specified for parameter 'FGLDRM_poll'
/var/tmp/portage/x11-drivers/ati-drivers-8.32.5/work/common/lib/modules/fglrx/build_mod/drmP.h:722: erreur: storage class specified for parameter 'FGLDRM_read'
/var/tmp/portage/x11-drivers/ati-drivers-8.32.5/work/common/lib/modules/fglrx/build_mod/drmP.h:725: erreur: storage class specified for parameter 'FGLDRM_mem_init'
/var/tmp/portage/x11-drivers/ati-drivers-8.32.5/work/common/lib/modules/fglrx/build_mod/drmP.h:727: erreur: storage class specified for parameter 'FGLDRM_mem_info'
/var/tmp/portage/x11-drivers/ati-drivers-8.32.5/work/common/lib/modules/fglrx/build_mod/drmP.h:728: erreur: storage class specified for parameter 'FGLDRM_alloc'
/var/tmp/portage/x11-drivers/ati-drivers-8.32.5/work/common/lib/modules/fglrx/build_mod/drmP.h:729: erreur: storage class specified for parameter 'FGLDRM_calloc'
/var/tmp/portage/x11-drivers/ati-drivers-8.32.5/work/common/lib/modules/fglrx/build_mod/drmP.h:731: erreur: storage class specified for parameter 'FGLDRM_realloc'
/var/tmp/portage/x11-drivers/ati-drivers-8.32.5/work/common/lib/modules/fglrx/build_mod/drmP.h:732: erreur: storage class specified for parameter 'FGLDRM_free'
/var/tmp/portage/x11-drivers/ati-drivers-8.32.5/work/common/lib/modules/fglrx/build_mod/drmP.h:733: erreur: storage class specified for parameter 'FGLDRM_alloc_pages'
/var/tmp/portage/x11-drivers/ati-drivers-8.32.5/work/common/lib/modules/fglrx/build_mod/drmP.h:735: erreur: storage class specified for parameter 'FGLDRM_free_pages'
/var/tmp/portage/x11-drivers/ati-drivers-8.32.5/work/common/lib/modules/fglrx/build_mod/drmP.h:736: erreur: expected declaration specifiers or '...' before 'drm_device_t'
/var/tmp/portage/x11-drivers/ati-drivers-8.32.5/work/common/lib/modules/fglrx/build_mod/drmP.h:736: erreur: storage class specified for parameter 'FGLDRM_ioremap'
/var/tmp/portage/x11-drivers/ati-drivers-8.32.5/work/common/lib/modules/fglrx/build_mod/drmP.h:738: erreur: expected declaration specifiers or '...' before 'drm_device_t'
/var/tmp/portage/x11-drivers/ati-drivers-8.32.5/work/common/lib/modules/fglrx/build_mod/drmP.h:738: erreur: storage class specified for parameter 'FGLDRM_ioremap_nocache'
/var/tmp/portage/x11-drivers/ati-drivers-8.32.5/work/common/lib/modules/fglrx/build_mod/drmP.h:739: erreur: expected declaration specifiers or '...' before 'drm_device_t'
/var/tmp/portage/x11-drivers/ati-drivers-8.32.5/work/common/lib/modules/fglrx/build_mod/drmP.h:739: erreur: storage class specified for parameter 'FGLDRM_ioremapfree'
/var/tmp/portage/x11-drivers/ati-drivers-8.32.5/work/common/lib/modules/fglrx/build_mod/drmP.h:750: erreur: storage class specified for parameter 'FGLDRM_irq_by_busid'
/var/tmp/portage/x11-drivers/ati-drivers-8.32.5/work/common/lib/modules/fglrx/build_mod/drmP.h:752: erreur: storage class specified for parameter 'FGLDRM_getunique'
/var/tmp/portage/x11-drivers/ati-drivers-8.32.5/work/common/lib/modules/fglrx/build_mod/drmP.h:754: erreur: storage class specified for parameter 'FGLDRM_setunique'
/var/tmp/portage/x11-drivers/ati-drivers-8.32.5/work/common/lib/modules/fglrx/build_mod/drmP.h:756: erreur: storage class specified for parameter 'FGLDRM_getmap'
/var/tmp/portage/x11-drivers/ati-drivers-8.32.5/work/common/lib/modules/fglrx/build_mod/drmP.h:758: erreur: storage class specified for parameter 'FGLDRM_getclient'
/var/tmp/portage/x11-drivers/ati-drivers-8.32.5/work/common/lib/modules/fglrx/build_mod/drmP.h:760: erreur: storage class specified for parameter 'FGLDRM_getstats'
/var/tmp/portage/x11-drivers/ati-drivers-8.32.5/work/common/lib/modules/fglrx/build_mod/drmP.h:762: erreur: storage class specified for parameter 'FGLDRM_setversion'
/var/tmp/portage/x11-drivers/ati-drivers-8.32.5/work/common/lib/modules/fglrx/build_mod/drmP.h:766: erreur: storage class specified for parameter 'FGLDRM_resctx'
/var/tmp/portage/x11-drivers/ati-drivers-8.32.5/work/common/lib/modules/fglrx/build_mod/drmP.h:768: erreur: storage class specified for parameter 'FGLDRM_addctx'
/var/tmp/portage/x11-drivers/ati-drivers-8.32.5/work/common/lib/modules/fglrx/build_mod/drmP.h:770: erreur: storage class specified for parameter 'FGLDRM_modctx'
/var/tmp/portage/x11-drivers/ati-drivers-8.32.5/work/common/lib/modules/fglrx/build_mod/drmP.h:772: erreur: storage class specified for parameter 'FGLDRM_getctx'
/var/tmp/portage/x11-drivers/ati-drivers-8.32.5/work/common/lib/modules/fglrx/build_mod/drmP.h:774: erreur: storage class specified for parameter 'FGLDRM_switchctx'
/var/tmp/portage/x11-drivers/ati-drivers-8.32.5/work/common/lib/modules/fglrx/build_mod/drmP.h:776: erreur: storage class specified for parameter 'FGLDRM_newctx'
/var/tmp/portage/x11-drivers/ati-drivers-8.32.5/work/common/lib/modules/fglrx/build_mod/drmP.h:778: erreur: storage class specified for parameter 'FGLDRM_rmctx'
/var/tmp/portage/x11-drivers/ati-drivers-8.32.5/work/common/lib/modules/fglrx/build_mod/drmP.h:780: erreur: expected ')' before '*' token
/var/tmp/portage/x11-drivers/ati-drivers-8.32.5/work/common/lib/modules/fglrx/build_mod/drmP.h:781: erreur: expected ')' before '*' token
/var/tmp/portage/x11-drivers/ati-drivers-8.32.5/work/common/lib/modules/fglrx/build_mod/drmP.h:789: erreur: storage class specified for parameter 'FGLDRM_setsareactx'
/var/tmp/portage/x11-drivers/ati-drivers-8.32.5/work/common/lib/modules/fglrx/build_mod/drmP.h:791: erreur: storage class specified for parameter 'FGLDRM_getsareactx'
/var/tmp/portage/x11-drivers/ati-drivers-8.32.5/work/common/lib/modules/fglrx/build_mod/drmP.h:795: erreur: storage class specified for parameter 'FGLDRM_adddraw'
/var/tmp/portage/x11-drivers/ati-drivers-8.32.5/work/common/lib/modules/fglrx/build_mod/drmP.h:797: erreur: storage class specified for parameter 'FGLDRM_rmdraw'
/var/tmp/portage/x11-drivers/ati-drivers-8.32.5/work/common/lib/modules/fglrx/build_mod/drmP.h:801: erreur: expected ')' before '*' token
/var/tmp/portage/x11-drivers/ati-drivers-8.32.5/work/common/lib/modules/fglrx/build_mod/drmP.h:803: erreur: expected ')' before '*' token
/var/tmp/portage/x11-drivers/ati-drivers-8.32.5/work/common/lib/modules/fglrx/build_mod/drmP.h:805: erreur: storage class specified for parameter 'FGLDRM_getmagic'
/var/tmp/portage/x11-drivers/ati-drivers-8.32.5/work/common/lib/modules/fglrx/build_mod/drmP.h:807: erreur: storage class specified for parameter 'FGLDRM_authmagic'
/var/tmp/portage/x11-drivers/ati-drivers-8.32.5/work/common/lib/modules/fglrx/build_mod/drmP.h:811: erreur: storage class specified for parameter 'FGLDRM_noop'
/var/tmp/portage/x11-drivers/ati-drivers-8.32.5/work/common/lib/modules/fglrx/build_mod/drmP.h:815: erreur: storage class specified for parameter 'FGLDRM_lock_take'
/var/tmp/portage/x11-drivers/ati-drivers-8.32.5/work/common/lib/modules/fglrx/build_mod/drmP.h:816: erreur: expected ')' before '*' token
/var/tmp/portage/x11-drivers/ati-drivers-8.32.5/work/common/lib/modules/fglrx/build_mod/drmP.h:819: erreur: expected ')' before '*' token
/var/tmp/portage/x11-drivers/ati-drivers-8.32.5/work/common/lib/modules/fglrx/build_mod/drmP.h:822: erreur: storage class specified for parameter 'FGLDRM_notifier'
/var/tmp/portage/x11-drivers/ati-drivers-8.32.5/work/common/lib/modules/fglrx/build_mod/drmP.h:825: erreur: storage class specified for parameter 'FGLDRM_order'
/var/tmp/portage/x11-drivers/ati-drivers-8.32.5/work/common/lib/modules/fglrx/build_mod/drmP.h:827: erreur: storage class specified for parameter 'FGLDRM_addmap'
/var/tmp/portage/x11-drivers/ati-drivers-8.32.5/work/common/lib/modules/fglrx/build_mod/drmP.h:829: erreur: storage class specified for parameter 'FGLDRM_rmmap'
/var/tmp/portage/x11-drivers/ati-drivers-8.32.5/work/common/lib/modules/fglrx/build_mod/drmP.h:897: erreur: expected declaration specifiers or '...' before 'drm_device_t'
/var/tmp/portage/x11-drivers/ati-drivers-8.32.5/work/common/lib/modules/fglrx/build_mod/drmP.h:901: erreur: expected ')' before '*' token
/var/tmp/portage/x11-drivers/ati-drivers-8.32.5/work/common/lib/modules/fglrx/build_mod/drmP.h:907: erreur: storage class specified for parameter 'FGLDRM_proc_cleanup'
/var/tmp/portage/x11-drivers/ati-drivers-8.32.5/work/common/lib/modules/fglrx/build_mod/drmP.h:910: erreur: expected ')' before '*' token
/var/tmp/portage/x11-drivers/ati-drivers-8.32.5/work/common/lib/modules/fglrx/build_mod/drmP.h:913: erreur: expected ')' before '*' token
/var/tmp/portage/x11-drivers/ati-drivers-8.32.5/work/common/lib/modules/fglrx/build_mod/drmP.h:917: erreur: expected ')' before '*' token
/var/tmp/portage/x11-drivers/ati-drivers-8.32.5/work/common/lib/modules/fglrx/build_mod/drmP.h:920: erreur: expected ')' before '*' token
In file included from /var/tmp/portage/x11-drivers/ati-drivers-8.32.5/work/common/lib/modules/fglrx/build_mod/firegl_public.c:334:
/var/tmp/portage/x11-drivers/ati-drivers-8.32.5/work/common/lib/modules/fglrx/build_mod/drm_proc.h:44: erreur: storage class specified for parameter 'FGLDRM_name_info'
/var/tmp/portage/x11-drivers/ati-drivers-8.32.5/work/common/lib/modules/fglrx/build_mod/drm_proc.h:46: erreur: storage class specified for parameter 'FGLDRM_vm_info'
/var/tmp/portage/x11-drivers/ati-drivers-8.32.5/work/common/lib/modules/fglrx/build_mod/drm_proc.h:48: erreur: storage class specified for parameter 'FGLDRM_clients_info'
/var/tmp/portage/x11-drivers/ati-drivers-8.32.5/work/common/lib/modules/fglrx/build_mod/drm_proc.h:50: erreur: storage class specified for parameter 'FGLDRM_queues_info'
/var/tmp/portage/x11-drivers/ati-drivers-8.32.5/work/common/lib/modules/fglrx/build_mod/drm_proc.h:52: erreur: storage class specified for parameter 'FGLDRM_bufs_info'
/var/tmp/portage/x11-drivers/ati-drivers-8.32.5/work/common/lib/modules/fglrx/build_mod/drm_proc.h:55: erreur: storage class specified for parameter 'FGLDRM_vma_info'
/var/tmp/portage/x11-drivers/ati-drivers-8.32.5/work/common/lib/modules/fglrx/build_mod/drm_proc.h:64: erreur: parameter 'FGLDRM_proc_list' is initialized
/var/tmp/portage/x11-drivers/ati-drivers-8.32.5/work/common/lib/modules/fglrx/build_mod/drm_proc.h:65: attention : accolades autour d'une initialisation de scalaire
/var/tmp/portage/x11-drivers/ati-drivers-8.32.5/work/common/lib/modules/fglrx/build_mod/drm_proc.h:65: attention : (near initialization for 'FGLDRM_proc_list')
/var/tmp/portage/x11-drivers/ati-drivers-8.32.5/work/common/lib/modules/fglrx/build_mod/drm_proc.h:65: attention : initialization from incompatible pointer type
/var/tmp/portage/x11-drivers/ati-drivers-8.32.5/work/common/lib/modules/fglrx/build_mod/drm_proc.h:65: attention : éléments en excès dans l'initialisation d'un scalaire
/var/tmp/portage/x11-drivers/ati-drivers-8.32.5/work/common/lib/modules/fglrx/build_mod/drm_proc.h:65: attention : (near initialization for 'FGLDRM_proc_list')
/var/tmp/portage/x11-drivers/ati-drivers-8.32.5/work/common/lib/modules/fglrx/build_mod/drm_proc.h:66: attention : accolades autour d'une initialisation de scalaire
/var/tmp/portage/x11-drivers/ati-drivers-8.32.5/work/common/lib/modules/fglrx/build_mod/drm_proc.h:66: attention : (near initialization for 'FGLDRM_proc_list')
/var/tmp/portage/x11-drivers/ati-drivers-8.32.5/work/common/lib/modules/fglrx/build_mod/drm_proc.h:66: attention : initialization from incompatible pointer type
/var/tmp/portage/x11-drivers/ati-drivers-8.32.5/work/common/lib/modules/fglrx/build_mod/drm_proc.h:66: attention : éléments en excès dans l'initialisation d'un scalaire
/var/tmp/portage/x11-drivers/ati-drivers-8.32.5/work/common/lib/modules/fglrx/build_mod/drm_proc.h:66: attention : (near initialization for 'FGLDRM_proc_list')
/var/tmp/portage/x11-drivers/ati-drivers-8.32.5/work/common/lib/modules/fglrx/build_mod/drm_proc.h:66: attention : éléments en excès dans l'initialisation d'un scalaire
/var/tmp/portage/x11-drivers/ati-drivers-8.32.5/work/common/lib/modules/fglrx/build_mod/drm_proc.h:66: attention : (near initialization for 'FGLDRM_proc_list')
/var/tmp/portage/x11-drivers/ati-drivers-8.32.5/work/common/lib/modules/fglrx/build_mod/drm_proc.h:67: attention : accolades autour d'une initialisation de scalaire
/var/tmp/portage/x11-drivers/ati-drivers-8.32.5/work/common/lib/modules/fglrx/build_mod/drm_proc.h:67: attention : (near initialization for 'FGLDRM_proc_list')
/var/tmp/portage/x11-drivers/ati-drivers-8.32.5/work/common/lib/modules/fglrx/build_mod/drm_proc.h:67: attention : initialization from incompatible pointer type
/var/tmp/portage/x11-drivers/ati-drivers-8.32.5/work/common/lib/modules/fglrx/build_mod/drm_proc.h:67: attention : éléments en excès dans l'initialisation d'un scalaire
/var/tmp/portage/x11-drivers/ati-drivers-8.32.5/work/common/lib/modules/fglrx/build_mod/drm_proc.h:67: attention : (near initialization for 'FGLDRM_proc_list')
/var/tmp/portage/x11-drivers/ati-drivers-8.32.5/work/common/lib/modules/fglrx/build_mod/drm_proc.h:67: attention : éléments en excès dans l'initialisation d'un scalaire
/var/tmp/portage/x11-drivers/ati-drivers-8.32.5/work/common/lib/modules/fglrx/build_mod/drm_proc.h:67: attention : (near initialization for 'FGLDRM_proc_list')
/var/tmp/portage/x11-drivers/ati-drivers-8.32.5/work/common/lib/modules/fglrx/build_mod/drm_proc.h:68: attention : accolades autour d'une initialisation de scalaire
/var/tmp/portage/x11-drivers/ati-drivers-8.32.5/work/common/lib/modules/fglrx/build_mod/drm_proc.h:68: attention : (near initialization for 'FGLDRM_proc_list')
/var/tmp/portage/x11-drivers/ati-drivers-8.32.5/work/common/lib/modules/fglrx/build_mod/drm_proc.h:68: attention : initialization from incompatible pointer type
/var/tmp/portage/x11-drivers/ati-drivers-8.32.5/work/common/lib/modules/fglrx/build_mod/drm_proc.h:68: attention : éléments en excès dans l'initialisation d'un scalaire
/var/tmp/portage/x11-drivers/ati-drivers-8.32.5/work/common/lib/modules/fglrx/build_mod/drm_proc.h:68: attention : (near initialization for 'FGLDRM_proc_list')
/var/tmp/portage/x11-drivers/ati-drivers-8.32.5/work/common/lib/modules/fglrx/build_mod/drm_proc.h:68: attention : éléments en excès dans l'initialisation d'un scalaire
/var/tmp/portage/x11-drivers/ati-drivers-8.32.5/work/common/lib/modules/fglrx/build_mod/drm_proc.h:68: attention : (near initialization for 'FGLDRM_proc_list')
/var/tmp/portage/x11-drivers/ati-drivers-8.32.5/work/common/lib/modules/fglrx/build_mod/drm_proc.h:69: attention : accolades autour d'une initialisation de scalaire
/var/tmp/portage/x11-drivers/ati-drivers-8.32.5/work/common/lib/modules/fglrx/build_mod/drm_proc.h:69: attention : (near initialization for 'FGLDRM_proc_list')
/var/tmp/portage/x11-drivers/ati-drivers-8.32.5/work/common/lib/modules/fglrx/build_mod/drm_proc.h:69: attention : initialization from incompatible pointer type
/var/tmp/portage/x11-drivers/ati-drivers-8.32.5/work/common/lib/modules/fglrx/build_mod/drm_proc.h:69: attention : éléments en excès dans l'initialisation d'un scalaire
/var/tmp/portage/x11-drivers/ati-drivers-8.32.5/work/common/lib/modules/fglrx/build_mod/drm_proc.h:69: attention : (near initialization for 'FGLDRM_proc_list')
/var/tmp/portage/x11-drivers/ati-drivers-8.32.5/work/common/lib/modules/fglrx/build_mod/drm_proc.h:69: attention : éléments en excès dans l'initialisation d'un scalaire
/var/tmp/portage/x11-drivers/ati-drivers-8.32.5/work/common/lib/modules/fglrx/build_mod/drm_proc.h:69: attention : (near initialization for 'FGLDRM_proc_list')
/var/tmp/portage/x11-drivers/ati-drivers-8.32.5/work/common/lib/modules/fglrx/build_mod/drm_proc.h:70: attention : accolades autour d'une initialisation de scalaire
/var/tmp/portage/x11-drivers/ati-drivers-8.32.5/work/common/lib/modules/fglrx/build_mod/drm_proc.h:70: attention : (near initialization for 'FGLDRM_proc_list')
/var/tmp/portage/x11-drivers/ati-drivers-8.32.5/work/common/lib/modules/fglrx/build_mod/drm_proc.h:70: attention : initialization from incompatible pointer type
/var/tmp/portage/x11-drivers/ati-drivers-8.32.5/work/common/lib/modules/fglrx/build_mod/drm_proc.h:70: attention : éléments en excès dans l'initialisation d'un scalaire
/var/tmp/portage/x11-drivers/ati-drivers-8.32.5/work/common/lib/modules/fglrx/build_mod/drm_proc.h:70: attention : (near initialization for 'FGLDRM_proc_list')
/var/tmp/portage/x11-drivers/ati-drivers-8.32.5/work/common/lib/modules/fglrx/build_mod/drm_proc.h:70: attention : éléments en excès dans l'initialisation d'un scalaire
/var/tmp/portage/x11-drivers/ati-drivers-8.32.5/work/common/lib/modules/fglrx/build_mod/drm_proc.h:70: attention : (near initialization for 'FGLDRM_proc_list')
/var/tmp/portage/x11-drivers/ati-drivers-8.32.5/work/common/lib/modules/fglrx/build_mod/drm_proc.h:72: attention : accolades autour d'une initialisation de scalaire
/var/tmp/portage/x11-drivers/ati-drivers-8.32.5/work/common/lib/modules/fglrx/build_mod/drm_proc.h:72: attention : (near initialization for 'FGLDRM_proc_list')
/var/tmp/portage/x11-drivers/ati-drivers-8.32.5/work/common/lib/modules/fglrx/build_mod/drm_proc.h:72: attention : initialization from incompatible pointer type
/var/tmp/portage/x11-drivers/ati-drivers-8.32.5/work/common/lib/modules/fglrx/build_mod/drm_proc.h:72: attention : éléments en excès dans l'initialisation d'un scalaire
/var/tmp/portage/x11-drivers/ati-drivers-8.32.5/work/common/lib/modules/fglrx/build_mod/drm_proc.h:72: attention : (near initialization for 'FGLDRM_proc_list')
/var/tmp/portage/x11-drivers/ati-drivers-8.32.5/work/common/lib/modules/fglrx/build_mod/drm_proc.h:72: attention : éléments en excès dans l'initialisation d'un scalaire
/var/tmp/portage/x11-drivers/ati-drivers-8.32.5/work/common/lib/modules/fglrx/build_mod/drm_proc.h:72: attention : (near initialization for 'FGLDRM_proc_list')
/var/tmp/portage/x11-drivers/ati-drivers-8.32.5/work/common/lib/modules/fglrx/build_mod/drm_proc.h:90: erreur: expected ')' before '*' token
/var/tmp/portage/x11-drivers/ati-drivers-8.32.5/work/common/lib/modules/fglrx/build_mod/drm_proc.h:144: erreur: expected '=', ',', ';', 'asm' or '__attribute__' before '{' token
/var/tmp/portage/x11-drivers/ati-drivers-8.32.5/work/common/lib/modules/fglrx/build_mod/drm_proc.h:174: erreur: expected '=', ',', ';', 'asm' or '__attribute__' before '{' token
/var/tmp/portage/x11-drivers/ati-drivers-8.32.5/work/common/lib/modules/fglrx/build_mod/drm_proc.h:213: erreur: expected '=', ',', ';', 'asm' or '__attribute__' before '{' token
/var/tmp/portage/x11-drivers/ati-drivers-8.32.5/work/common/lib/modules/fglrx/build_mod/drm_proc.h:269: erreur: expected '=', ',', ';', 'asm' or '__attribute__' before '{' token
/var/tmp/portage/x11-drivers/ati-drivers-8.32.5/work/common/lib/modules/fglrx/build_mod/drm_proc.h:292: erreur: expected '=', ',', ';', 'asm' or '__attribute__' before '{' token
/var/tmp/portage/x11-drivers/ati-drivers-8.32.5/work/common/lib/modules/fglrx/build_mod/drm_proc.h:339: erreur: expected '=', ',', ';', 'asm' or '__attribute__' before '{' token
/var/tmp/portage/x11-drivers/ati-drivers-8.32.5/work/common/lib/modules/fglrx/build_mod/drm_proc.h:362: erreur: expected '=', ',', ';', 'asm' or '__attribute__' before '{' token
/var/tmp/portage/x11-drivers/ati-drivers-8.32.5/work/common/lib/modules/fglrx/build_mod/drm_proc.h:409: erreur: expected '=', ',', ';', 'asm' or '__attribute__' before '{' token
/var/tmp/portage/x11-drivers/ati-drivers-8.32.5/work/common/lib/modules/fglrx/build_mod/drm_proc.h:432: erreur: expected '=', ',', ';', 'asm' or '__attribute__' before '{' token
/var/tmp/portage/x11-drivers/ati-drivers-8.32.5/work/common/lib/modules/fglrx/build_mod/drm_proc.h:466: erreur: expected '=', ',', ';', 'asm' or '__attribute__' before '{' token
/var/tmp/portage/x11-drivers/ati-drivers-8.32.5/work/common/lib/modules/fglrx/build_mod/drm_proc.h:480: erreur: expected '=', ',', ';', 'asm' or '__attribute__' before '{' token
/var/tmp/portage/x11-drivers/ati-drivers-8.32.5/work/common/lib/modules/fglrx/build_mod/drm_proc.h:537: erreur: expected '=', ',', ';', 'asm' or '__attribute__' before '{' token
/var/tmp/portage/x11-drivers/ati-drivers-8.32.5/work/common/lib/modules/fglrx/build_mod/firegl_public.c:340: erreur: storage class specified for parameter 'drm_proclist'
/var/tmp/portage/x11-drivers/ati-drivers-8.32.5/work/common/lib/modules/fglrx/build_mod/firegl_public.c:340: erreur: parameter 'drm_proclist' is initialized
/var/tmp/portage/x11-drivers/ati-drivers-8.32.5/work/common/lib/modules/fglrx/build_mod/firegl_public.c:352: erreur: storage class specified for parameter 'firegl_stub_list_t'
/var/tmp/portage/x11-drivers/ati-drivers-8.32.5/work/common/lib/modules/fglrx/build_mod/firegl_public.c:353: erreur: expected '=', ',', ';', 'asm' or '__attribute__' before 'firegl_stub_list'
/var/tmp/portage/x11-drivers/ati-drivers-8.32.5/work/common/lib/modules/fglrx/build_mod/firegl_public.c:355: erreur: storage class specified for parameter 'firegl_stub_root'
/var/tmp/portage/x11-drivers/ati-drivers-8.32.5/work/common/lib/modules/fglrx/build_mod/firegl_public.c:356: erreur: storage class specified for parameter 'firegl_minor'
/var/tmp/portage/x11-drivers/ati-drivers-8.32.5/work/common/lib/modules/fglrx/build_mod/firegl_public.c:359: erreur: expected declaration specifiers or '...' before 'device_t'
/var/tmp/portage/x11-drivers/ati-drivers-8.32.5/work/common/lib/modules/fglrx/build_mod/firegl_public.c:362: erreur: storage class specified for parameter 'firegl_drm_stub_info_t'
/var/tmp/portage/x11-drivers/ati-drivers-8.32.5/work/common/lib/modules/fglrx/build_mod/firegl_public.c:363: erreur: expected '=', ',', ';', 'asm' or '__attribute__' before 'firegl_stub_info'
/var/tmp/portage/x11-drivers/ati-drivers-8.32.5/work/common/lib/modules/fglrx/build_mod/firegl_public.c:365: erreur: storage class specified for parameter '__ke_pte_phys_addr_str'
/var/tmp/portage/x11-drivers/ati-drivers-8.32.5/work/common/lib/modules/fglrx/build_mod/firegl_public.c:368: erreur: expected '=', ',', ';', 'asm' or '__attribute__' before '{' token
/var/tmp/portage/x11-drivers/ati-drivers-8.32.5/work/common/lib/modules/fglrx/build_mod/firegl_public.c:373: erreur: expected '=', ',', ';', 'asm' or '__attribute__' before '{' token
/var/tmp/portage/x11-drivers/ati-drivers-8.32.5/work/common/lib/modules/fglrx/build_mod/firegl_public.c:384: erreur: expected '=', ',', ';', 'asm' or '__attribute__' before '{' token
/var/tmp/portage/x11-drivers/ati-drivers-8.32.5/work/common/lib/modules/fglrx/build_mod/firegl_public.c:385: erreur: expected '=', ',', ';', 'asm' or '__attribute__' before '{' token
/var/tmp/portage/x11-drivers/ati-drivers-8.32.5/work/common/lib/modules/fglrx/build_mod/firegl_public.c:386: erreur: expected '=', ',', ';', 'asm' or '__attribute__' before '{' token
/var/tmp/portage/x11-drivers/ati-drivers-8.32.5/work/common/lib/modules/fglrx/build_mod/firegl_public.c:387: erreur: expected '=', ',', ';', 'asm' or '__attribute__' before '{' token
/var/tmp/portage/x11-drivers/ati-drivers-8.32.5/work/common/lib/modules/fglrx/build_mod/firegl_public.c:388: erreur: expected '=', ',', ';', 'asm' or '__attribute__' before '{' token
/var/tmp/portage/x11-drivers/ati-drivers-8.32.5/work/common/lib/modules/fglrx/build_mod/firegl_public.c:389: erreur: expected '=', ',', ';', 'asm' or '__attribute__' before '{' token
/var/tmp/portage/x11-drivers/ati-drivers-8.32.5/work/common/lib/modules/fglrx/build_mod/firegl_public.c:390: erreur: expected '=', ',', ';', 'asm' or '__attribute__' before '{' token
/var/tmp/portage/x11-drivers/ati-drivers-8.32.5/work/common/lib/modules/fglrx/build_mod/firegl_public.c:395: erreur: expected '=', ',', ';', 'asm' or '__attribute__' before '{' token
/var/tmp/portage/x11-drivers/ati-drivers-8.32.5/work/common/lib/modules/fglrx/build_mod/firegl_public.c:401: erreur: expected '=', ',', ';', 'asm' or '__attribute__' before '{' token
/var/tmp/portage/x11-drivers/ati-drivers-8.32.5/work/common/lib/modules/fglrx/build_mod/firegl_public.c:409: erreur: expected '=', ',', ';', 'asm' or '__attribute__' before '{' token
/var/tmp/portage/x11-drivers/ati-drivers-8.32.5/work/common/lib/modules/fglrx/build_mod/firegl_public.c:419: erreur: expected '=', ',', ';', 'asm' or '__attribute__' before '{' token
/var/tmp/portage/x11-drivers/ati-drivers-8.32.5/work/common/lib/modules/fglrx/build_mod/firegl_public.c:424: erreur: expected declaration specifiers or '...' before 'poll_table'
/var/tmp/portage/x11-drivers/ati-drivers-8.32.5/work/common/lib/modules/fglrx/build_mod/firegl_public.c:425: erreur: expected '=', ',', ';', 'asm' or '__attribute__' before '{' token
/var/tmp/portage/x11-drivers/ati-drivers-8.32.5/work/common/lib/modules/fglrx/build_mod/firegl_public.c:442: erreur: expected '=', ',', ';', 'asm' or '__attribute__' before '{' token
/var/tmp/portage/x11-drivers/ati-drivers-8.32.5/work/common/lib/modules/fglrx/build_mod/firegl_public.c:446: erreur: storage class specified for parameter 'firegl_interrupt_file_ops'
/var/tmp/portage/x11-drivers/ati-drivers-8.32.5/work/common/lib/modules/fglrx/build_mod/firegl_public.c:446: erreur: parameter 'firegl_interrupt_file_ops' is initialized
/var/tmp/portage/x11-drivers/ati-drivers-8.32.5/work/common/lib/modules/fglrx/build_mod/firegl_public.c:447: erreur: 'firegl_interrupt_open_wrap' undeclared (first use in this function)
/var/tmp/portage/x11-drivers/ati-drivers-8.32.5/work/common/lib/modules/fglrx/build_mod/firegl_public.c:448: erreur: 'firegl_interrupt_read_wrap' undeclared (first use in this function)
/var/tmp/portage/x11-drivers/ati-drivers-8.32.5/work/common/lib/modules/fglrx/build_mod/firegl_public.c:449: erreur: 'firegl_interrupt_release_wrap' undeclared (first use in this function)
/var/tmp/portage/x11-drivers/ati-drivers-8.32.5/work/common/lib/modules/fglrx/build_mod/firegl_public.c:450: erreur: 'firegl_interrupt_poll_wrap' undeclared (first use in this function)
/var/tmp/portage/x11-drivers/ati-drivers-8.32.5/work/common/lib/modules/fglrx/build_mod/firegl_public.c:451: erreur: 'firegl_interrupt_write_wrap' undeclared (first use in this function)
/var/tmp/portage/x11-drivers/ati-drivers-8.32.5/work/common/lib/modules/fglrx/build_mod/firegl_public.c:454: erreur: parameter 'firegl_proc_list' is initialized
/var/tmp/portage/x11-drivers/ati-drivers-8.32.5/work/common/lib/modules/fglrx/build_mod/firegl_public.c:456: attention : accolades autour d'une initialisation de scalaire
/var/tmp/portage/x11-drivers/ati-drivers-8.32.5/work/common/lib/modules/fglrx/build_mod/firegl_public.c:456: attention : (near initialization for 'firegl_proc_list')
/var/tmp/portage/x11-drivers/ati-drivers-8.32.5/work/common/lib/modules/fglrx/build_mod/firegl_public.c:456: attention : initialization from incompatible pointer type
/var/tmp/portage/x11-drivers/ati-drivers-8.32.5/work/common/lib/modules/fglrx/build_mod/firegl_public.c:456: erreur: 'drm_name_info_wrap' undeclared (first use in this function)
/var/tmp/portage/x11-drivers/ati-drivers-8.32.5/work/common/lib/modules/fglrx/build_mod/firegl_public.c:456: attention : éléments en excès dans l'initialisation d'un scalaire
/var/tmp/portage/x11-drivers/ati-drivers-8.32.5/work/common/lib/modules/fglrx/build_mod/firegl_public.c:456: attention : (near initialization for 'firegl_proc_list')
/var/tmp/portage/x11-drivers/ati-drivers-8.32.5/work/common/lib/modules/fglrx/build_mod/firegl_public.c:456: attention : éléments en excès dans l'initialisation d'un scalaire
/var/tmp/portage/x11-drivers/ati-drivers-8.32.5/work/common/lib/modules/fglrx/build_mod/firegl_public.c:456: attention : (near initialization for 'firegl_proc_list')
/var/tmp/portage/x11-drivers/ati-drivers-8.32.5/work/common/lib/modules/fglrx/build_mod/firegl_public.c:457: attention : accolades autour d'une initialisation de scalaire
/var/tmp/portage/x11-drivers/ati-drivers-8.32.5/work/common/lib/modules/fglrx/build_mod/firegl_public.c:457: attention : (near initialization for 'firegl_proc_list')
/var/tmp/portage/x11-drivers/ati-drivers-8.32.5/work/common/lib/modules/fglrx/build_mod/firegl_public.c:457: attention : initialization from incompatible pointer type
/var/tmp/portage/x11-drivers/ati-drivers-8.32.5/work/common/lib/modules/fglrx/build_mod/firegl_public.c:457: erreur: 'drm_mem_info_wrap' undeclared (first use in this function)
/var/tmp/portage/x11-drivers/ati-drivers-8.32.5/work/common/lib/modules/fglrx/build_mod/firegl_public.c:457: attention : éléments en excès dans l'initialisation d'un scalaire
/var/tmp/portage/x11-drivers/ati-drivers-8.32.5/work/common/lib/modules/fglrx/build_mod/firegl_public.c:457: attention : (near initialization for 'firegl_proc_list')
/var/tmp/portage/x11-drivers/ati-drivers-8.32.5/work/common/lib/modules/fglrx/build_mod/firegl_public.c:457: attention : éléments en excès dans l'initialisation d'un scalaire
/var/tmp/portage/x11-drivers/ati-drivers-8.32.5/work/common/lib/modules/fglrx/build_mod/firegl_public.c:457: attention : (near initialization for 'firegl_proc_list')
/var/tmp/portage/x11-drivers/ati-drivers-8.32.5/work/common/lib/modules/fglrx/build_mod/firegl_public.c:457: attention : éléments en excès dans l'initialisation d'un scalaire
/var/tmp/portage/x11-drivers/ati-drivers-8.32.5/work/common/lib/modules/fglrx/build_mod/firegl_public.c:457: attention : (near initialization for 'firegl_proc_list')
/var/tmp/portage/x11-drivers/ati-drivers-8.32.5/work/common/lib/modules/fglrx/build_mod/firegl_public.c:458: attention : accolades autour d'une initialisation de scalaire
/var/tmp/portage/x11-drivers/ati-drivers-8.32.5/work/common/lib/modules/fglrx/build_mod/firegl_public.c:458: attention : (near initialization for 'firegl_proc_list')
/var/tmp/portage/x11-drivers/ati-drivers-8.32.5/work/common/lib/modules/fglrx/build_mod/firegl_public.c:458: attention : initialization from incompatible pointer type
/var/tmp/portage/x11-drivers/ati-drivers-8.32.5/work/common/lib/modules/fglrx/build_mod/firegl_public.c:458: erreur: 'drm_mem_info1_wrap' undeclared (first use in this function)
/var/tmp/portage/x11-drivers/ati-drivers-8.32.5/work/common/lib/modules/fglrx/build_mod/firegl_public.c:458: attention : éléments en excès dans l'initialisation d'un scalaire
/var/tmp/portage/x11-drivers/ati-drivers-8.32.5/work/common/lib/modules/fglrx/build_mod/firegl_public.c:458: attention : (near initialization for 'firegl_proc_list')
/var/tmp/portage/x11-drivers/ati-drivers-8.32.5/work/common/lib/modules/fglrx/build_mod/firegl_public.c:458: attention : éléments en excès dans l'initialisation d'un scalaire
/var/tmp/portage/x11-drivers/ati-drivers-8.32.5/work/common/lib/modules/fglrx/build_mod/firegl_public.c:458: attention : (near initialization for 'firegl_proc_list')
/var/tmp/portage/x11-drivers/ati-drivers-8.32.5/work/common/lib/modules/fglrx/build_mod/firegl_public.c:458: attention : éléments en excès dans l'initialisation d'un scalaire
/var/tmp/portage/x11-drivers/ati-drivers-8.32.5/work/common/lib/modules/fglrx/build_mod/firegl_public.c:458: attention : (near initialization for 'firegl_proc_list')
/var/tmp/portage/x11-drivers/ati-drivers-8.32.5/work/common/lib/modules/fglrx/build_mod/firegl_public.c:459: attention : accolades autour d'une initialisation de scalaire
/var/tmp/portage/x11-drivers/ati-drivers-8.32.5/work/common/lib/modules/fglrx/build_mod/firegl_public.c:459: attention : (near initialization for 'firegl_proc_list')
/var/tmp/portage/x11-drivers/ati-drivers-8.32.5/work/common/lib/modules/fglrx/build_mod/firegl_public.c:459: attention : initialization from incompatible pointer type
/var/tmp/portage/x11-drivers/ati-drivers-8.32.5/work/common/lib/modules/fglrx/build_mod/firegl_public.c:459: erreur: 'drm_vm_info_wrap' undeclared (first use in this function)
/var/tmp/portage/x11-drivers/ati-drivers-8.32.5/work/common/lib/modules/fglrx/build_mod/firegl_public.c:459: attention : éléments en excès dans l'initialisation d'un scalaire
/var/tmp/portage/x11-drivers/ati-drivers-8.32.5/work/common/lib/modules/fglrx/build_mod/firegl_public.c:459: attention : (near initialization for 'firegl_proc_list')
/var/tmp/portage/x11-drivers/ati-drivers-8.32.5/work/common/lib/modules/fglrx/build_mod/firegl_public.c:459: attention : éléments en excès dans l'initialisation d'un scalaire
/var/tmp/portage/x11-drivers/ati-drivers-8.32.5/work/common/lib/modules/fglrx/build_mod/firegl_public.c:459: attention : (near initialization for 'firegl_proc_list')
/var/tmp/portage/x11-drivers/ati-drivers-8.32.5/work/common/lib/modules/fglrx/build_mod/firegl_public.c:459: attention : éléments en excès dans l'initialisation d'un scalaire
/var/tmp/portage/x11-drivers/ati-drivers-8.32.5/work/common/lib/modules/fglrx/build_mod/firegl_public.c:459: attention : (near initialization for 'firegl_proc_list')
/var/tmp/portage/x11-drivers/ati-drivers-8.32.5/work/common/lib/modules/fglrx/build_mod/firegl_public.c:460: attention : accolades autour d'une initialisation de scalaire
/var/tmp/portage/x11-drivers/ati-drivers-8.32.5/work/common/lib/modules/fglrx/build_mod/firegl_public.c:460: attention : (near initialization for 'firegl_proc_list')
/var/tmp/portage/x11-drivers/ati-drivers-8.32.5/work/common/lib/modules/fglrx/build_mod/firegl_public.c:460: attention : initialization from incompatible pointer type
/var/tmp/portage/x11-drivers/ati-drivers-8.32.5/work/common/lib/modules/fglrx/build_mod/firegl_public.c:460: erreur: 'drm_clients_info_wrap' undeclared (first use in this function)
/var/tmp/portage/x11-drivers/ati-drivers-8.32.5/work/common/lib/modules/fglrx/build_mod/firegl_public.c:460: attention : éléments en excès dans l'initialisation d'un scalaire
/var/tmp/portage/x11-drivers/ati-drivers-8.32.5/work/common/lib/modules/fglrx/build_mod/firegl_public.c:460: attention : (near initialization for 'firegl_proc_list')
/var/tmp/portage/x11-drivers/ati-drivers-8.32.5/work/common/lib/modules/fglrx/build_mod/firegl_public.c:460: attention : éléments en excès dans l'initialisation d'un scalaire
/var/tmp/portage/x11-drivers/ati-drivers-8.32.5/work/common/lib/modules/fglrx/build_mod/firegl_public.c:460: attention : (near initialization for 'firegl_proc_list')
/var/tmp/portage/x11-drivers/ati-drivers-8.32.5/work/common/lib/modules/fglrx/build_mod/firegl_public.c:460: attention : éléments en excès dans l'initialisation d'un scalaire
/var/tmp/portage/x11-drivers/ati-drivers-8.32.5/work/common/lib/modules/fglrx/build_mod/firegl_public.c:460: attention : (near initialization for 'firegl_proc_list')
/var/tmp/portage/x11-drivers/ati-drivers-8.32.5/work/common/lib/modules/fglrx/build_mod/firegl_public.c:461: attention : accolades autour d'une initialisation de scalaire
/var/tmp/portage/x11-drivers/ati-drivers-8.32.5/work/common/lib/modules/fglrx/build_mod/firegl_public.c:461: attention : (near initialization for 'firegl_proc_list')
/var/tmp/portage/x11-drivers/ati-drivers-8.32.5/work/common/lib/modules/fglrx/build_mod/firegl_public.c:461: attention : initialization from incompatible pointer type
/var/tmp/portage/x11-drivers/ati-drivers-8.32.5/work/common/lib/modules/fglrx/build_mod/firegl_public.c:461: erreur: 'firegl_lock_info_wrap' undeclared (first use in this function)
/var/tmp/portage/x11-drivers/ati-drivers-8.32.5/work/common/lib/modules/fglrx/build_mod/firegl_public.c:461: attention : éléments en excès dans l'initialisation d'un scalaire
/var/tmp/portage/x11-drivers/ati-drivers-8.32.5/work/common/lib/modules/fglrx/build_mod/firegl_public.c:461: attention : (near initialization for 'firegl_proc_list')
/var/tmp/portage/x11-drivers/ati-drivers-8.32.5/work/common/lib/modules/fglrx/build_mod/firegl_public.c:461: attention : éléments en excès dans l'initialisation d'un scalaire
/var/tmp/portage/x11-drivers/ati-drivers-8.32.5/work/common/lib/modules/fglrx/build_mod/firegl_public.c:461: attention : (near initialization for 'firegl_proc_list')
/var/tmp/portage/x11-drivers/ati-drivers-8.32.5/work/common/lib/modules/fglrx/build_mod/firegl_public.c:461: attention : éléments en excès dans l'initialisation d'un scalaire
/var/tmp/portage/x11-drivers/ati-drivers-8.32.5/work/common/lib/modules/fglrx/build_mod/firegl_public.c:461: attention : (near initialization for 'firegl_proc_list')
/var/tmp/portage/x11-drivers/ati-drivers-8.32.5/work/common/lib/modules/fglrx/build_mod/firegl_public.c:462: attention : accolades autour d'une initialisation de scalaire
/var/tmp/portage/x11-drivers/ati-drivers-8.32.5/work/common/lib/modules/fglrx/build_mod/firegl_public.c:462: attention : (near initialization for 'firegl_proc_list')
/var/tmp/portage/x11-drivers/ati-drivers-8.32.5/work/common/lib/modules/fglrx/build_mod/firegl_public.c:462: attention : initialization from incompatible pointer type
/var/tmp/portage/x11-drivers/ati-drivers-8.32.5/work/common/lib/modules/fglrx/build_mod/firegl_public.c:462: erreur: 'firegl_umm_info_wrap' undeclared (first use in this function)
/var/tmp/portage/x11-drivers/ati-drivers-8.32.5/work/common/lib/modules/fglrx/build_mod/firegl_public.c:462: attention : éléments en excès dans l'initialisation d'un scalaire
/var/tmp/portage/x11-drivers/ati-drivers-8.32.5/work/common/lib/modules/fglrx/build_mod/firegl_public.c:462: attention : (near initialization for 'firegl_proc_list')
/var/tmp/portage/x11-drivers/ati-drivers-8.32.5/work/common/lib/modules/fglrx/build_mod/firegl_public.c:462: attention : éléments en excès dans l'initialisation d'un scalaire
/var/tmp/portage/x11-drivers/ati-drivers-8.32.5/work/common/lib/modules/fglrx/build_mod/firegl_public.c:462: attention : (near initialization for 'firegl_proc_list')
/var/tmp/portage/x11-drivers/ati-drivers-8.32.5/work/common/lib/modules/fglrx/build_mod/firegl_public.c:462: attention : éléments en excès dans l'initialisation d'un scalaire
/var/tmp/portage/x11-drivers/ati-drivers-8.32.5/work/common/lib/modules/fglrx/build_mod/firegl_public.c:462: attention : (near initialization for 'firegl_proc_list')
/var/tmp/portage/x11-drivers/ati-drivers-8.32.5/work/common/lib/modules/fglrx/build_mod/firegl_public.c:467: attention : accolades autour d'une initialisation de scalaire
/var/tmp/portage/x11-drivers/ati-drivers-8.32.5/work/common/lib/modules/fglrx/build_mod/firegl_public.c:467: attention : (near initialization for 'firegl_proc_list')
/var/tmp/portage/x11-drivers/ati-drivers-8.32.5/work/common/lib/modules/fglrx/build_mod/firegl_public.c:467: attention : initialization from incompatible pointer type
/var/tmp/portage/x11-drivers/ati-drivers-8.32.5/work/common/lib/modules/fglrx/build_mod/firegl_public.c:467: erreur: 'firegl_bios_version_wrap' undeclared (first use in this function)
/var/tmp/portage/x11-drivers/ati-drivers-8.32.5/work/common/lib/modules/fglrx/build_mod/firegl_public.c:467: attention : éléments en excès dans l'initialisation d'un scalaire
/var/tmp/portage/x11-drivers/ati-drivers-8.32.5/work/common/lib/modules/fglrx/build_mod/firegl_public.c:467: attention : (near initialization for 'firegl_proc_list')
/var/tmp/portage/x11-drivers/ati-drivers-8.32.5/work/common/lib/modules/fglrx/build_mod/firegl_public.c:467: attention : éléments en excès dans l'initialisation d'un scalaire
/var/tmp/portage/x11-drivers/ati-drivers-8.32.5/work/common/lib/modules/fglrx/build_mod/firegl_public.c:467: attention : (near initialization for 'firegl_proc_list')
/var/tmp/portage/x11-drivers/ati-drivers-8.32.5/work/common/lib/modules/fglrx/build_mod/firegl_public.c:467: attention : éléments en excès dans l'initialisation d'un scalaire
/var/tmp/portage/x11-drivers/ati-drivers-8.32.5/work/common/lib/modules/fglrx/build_mod/firegl_public.c:467: attention : (near initialization for 'firegl_proc_list')
/var/tmp/portage/x11-drivers/ati-drivers-8.32.5/work/common/lib/modules/fglrx/build_mod/firegl_public.c:468: attention : accolades autour d'une initialisation de scalaire
/var/tmp/portage/x11-drivers/ati-drivers-8.32.5/work/common/lib/modules/fglrx/build_mod/firegl_public.c:468: attention : (near initialization for 'firegl_proc_list')
/var/tmp/portage/x11-drivers/ati-drivers-8.32.5/work/common/lib/modules/fglrx/build_mod/firegl_public.c:468: attention : initialization from incompatible pointer type
/var/tmp/portage/x11-drivers/ati-drivers-8.32.5/work/common/lib/modules/fglrx/build_mod/firegl_public.c:468: attention : éléments en excès dans l'initialisation d'un scalaire
/var/tmp/portage/x11-drivers/ati-drivers-8.32.5/work/common/lib/modules/fglrx/build_mod/firegl_public.c:468: attention : (near initialization for 'firegl_proc_list')
/var/tmp/portage/x11-drivers/ati-drivers-8.32.5/work/common/lib/modules/fglrx/build_mod/firegl_public.c:468: attention : éléments en excès dans l'initialisation d'un scalaire
/var/tmp/portage/x11-drivers/ati-drivers-8.32.5/work/common/lib/modules/fglrx/build_mod/firegl_public.c:468: attention : (near initialization for 'firegl_proc_list')
/var/tmp/portage/x11-drivers/ati-drivers-8.32.5/work/common/lib/modules/fglrx/build_mod/firegl_public.c:468: attention : éléments en excès dans l'initialisation d'un scalaire
/var/tmp/portage/x11-drivers/ati-drivers-8.32.5/work/common/lib/modules/fglrx/build_mod/firegl_public.c:468: attention : (near initialization for 'firegl_proc_list')
/var/tmp/portage/x11-drivers/ati-drivers-8.32.5/work/common/lib/modules/fglrx/build_mod/firegl_public.c:469: attention : accolades autour d'une initialisation de scalaire
/var/tmp/portage/x11-drivers/ati-drivers-8.32.5/work/common/lib/modules/fglrx/build_mod/firegl_public.c:469: attention : (near initialization for 'firegl_proc_list')
/var/tmp/portage/x11-drivers/ati-drivers-8.32.5/work/common/lib/modules/fglrx/build_mod/firegl_public.c:469: attention : initialization from incompatible pointer type
/var/tmp/portage/x11-drivers/ati-drivers-8.32.5/work/common/lib/modules/fglrx/build_mod/firegl_public.c:469: attention : éléments en excès dans l'initialisation d'un scalaire
/var/tmp/portage/x11-drivers/ati-drivers-8.32.5/work/common/lib/modules/fglrx/build_mod/firegl_public.c:469: attention : (near initialization for 'firegl_proc_list')
/var/tmp/portage/x11-drivers/ati-drivers-8.32.5/work/common/lib/modules/fglrx/build_mod/firegl_public.c:469: attention : éléments en excès dans l'initialisation d'un scalaire
/var/tmp/portage/x11-drivers/ati-drivers-8.32.5/work/common/lib/modules/fglrx/build_mod/firegl_public.c:469: attention : (near initialization for 'firegl_proc_list')
/var/tmp/portage/x11-drivers/ati-drivers-8.32.5/work/common/lib/modules/fglrx/build_mod/firegl_public.c:469: attention : éléments en excès dans l'initialisation d'un scalaire
/var/tmp/portage/x11-drivers/ati-drivers-8.32.5/work/common/lib/modules/fglrx/build_mod/firegl_public.c:469: attention : (near initialization for 'firegl_proc_list')
/var/tmp/portage/x11-drivers/ati-drivers-8.32.5/work/common/lib/modules/fglrx/build_mod/firegl_public.c:472: erreur: expected ')' before '*' token
/var/tmp/portage/x11-drivers/ati-drivers-8.32.5/work/common/lib/modules/fglrx/build_mod/firegl_public.c:537: erreur: expected '=', ',', ';', 'asm' or '__attribute__' before '{' token
/var/tmp/portage/x11-drivers/ati-drivers-8.32.5/work/common/lib/modules/fglrx/build_mod/firegl_public.c:561: erreur: expected '=', ',', ';', 'asm' or '__attribute__' before '{' token
/var/tmp/portage/x11-drivers/ati-drivers-8.32.5/work/common/lib/modules/fglrx/build_mod/firegl_public.c:585: erreur: storage class specified for parameter 'firegl_stub_fops'
/var/tmp/portage/x11-drivers/ati-drivers-8.32.5/work/common/lib/modules/fglrx/build_mod/firegl_public.c:585: erreur: parameter 'firegl_stub_fops' is initialized
/var/tmp/portage/x11-drivers/ati-drivers-8.32.5/work/common/lib/modules/fglrx/build_mod/firegl_public.c:587: erreur: 'firegl_stub_open' undeclared (first use in this function)
/var/tmp/portage/x11-drivers/ati-drivers-8.32.5/work/common/lib/modules/fglrx/build_mod/firegl_public.c:590: erreur: expected declaration specifiers or '...' before 'device_t'
/var/tmp/portage/x11-drivers/ati-drivers-8.32.5/work/common/lib/modules/fglrx/build_mod/firegl_public.c:591: erreur: expected '=', ',', ';', 'asm' or '__attribute__' before '{' token
/var/tmp/portage/x11-drivers/ati-drivers-8.32.5/work/common/lib/modules/fglrx/build_mod/firegl_public.c:610: erreur: expected '=', ',', ';', 'asm' or '__attribute__' before '{' token
/var/tmp/portage/x11-drivers/ati-drivers-8.32.5/work/common/lib/modules/fglrx/build_mod/firegl_public.c:627: erreur: expected declaration specifiers or '...' before 'device_t'
/var/tmp/portage/x11-drivers/ati-drivers-8.32.5/work/common/lib/modules/fglrx/build_mod/firegl_public.c:628: erreur: expected '=', ',', ';', 'asm' or '__attribute__' before '{' token
/var/tmp/portage/x11-drivers/ati-drivers-8.32.5/work/common/lib/modules/fglrx/build_mod/firegl_public.c:662: erreur: expected '=', ',', ';', 'asm' or '__attribute__' before '{' token
/var/tmp/portage/x11-drivers/ati-drivers-8.32.5/work/common/lib/modules/fglrx/build_mod/firegl_public.c:671: erreur: storage class specified for parameter 'fglrx_pci_table'
/var/tmp/portage/x11-drivers/ati-drivers-8.32.5/work/common/lib/modules/fglrx/build_mod/firegl_public.c:671: erreur: parameter 'fglrx_pci_table' is initialized
/var/tmp/portage/x11-drivers/ati-drivers-8.32.5/work/common/lib/modules/fglrx/build_mod/firegl_public.c:673: attention : accolades autour d'une initialisation de scalaire
/var/tmp/portage/x11-drivers/ati-drivers-8.32.5/work/common/lib/modules/fglrx/build_mod/firegl_public.c:673: attention : (near initialization for 'fglrx_pci_table')
/var/tmp/portage/x11-drivers/ati-drivers-8.32.5/work/common/lib/modules/fglrx/build_mod/firegl_public.c:674: erreur: nom de champ dans l'initialisation de quelque chose n'étant ni un enregistrement ni une union
/var/tmp/portage/x11-drivers/ati-drivers-8.32.5/work/common/lib/modules/fglrx/build_mod/firegl_public.c:674: erreur: (near initialization for 'fglrx_pci_table')
/var/tmp/portage/x11-drivers/ati-drivers-8.32.5/work/common/lib/modules/fglrx/build_mod/firegl_public.c:674: attention : initialization makes pointer from integer without a cast
/var/tmp/portage/x11-drivers/ati-drivers-8.32.5/work/common/lib/modules/fglrx/build_mod/firegl_public.c:675: erreur: nom de champ dans l'initialisation de quelque chose n'étant ni un enregistrement ni une union
/var/tmp/portage/x11-drivers/ati-drivers-8.32.5/work/common/lib/modules/fglrx/build_mod/firegl_public.c:675: erreur: (near initialization for 'fglrx_pci_table')
/var/tmp/portage/x11-drivers/ati-drivers-8.32.5/work/common/lib/modules/fglrx/build_mod/firegl_public.c:675: attention : éléments en excès dans l'initialisation d'un scalaire
/var/tmp/portage/x11-drivers/ati-drivers-8.32.5/work/common/lib/modules/fglrx/build_mod/firegl_public.c:675: attention : (near initialization for 'fglrx_pci_table')
/var/tmp/portage/x11-drivers/ati-drivers-8.32.5/work/common/lib/modules/fglrx/build_mod/firegl_public.c:676: erreur: nom de champ dans l'initialisation de quelque chose n'étant ni un enregistrement ni une union
/var/tmp/portage/x11-drivers/ati-drivers-8.32.5/work/common/lib/modules/fglrx/build_mod/firegl_public.c:676: erreur: (near initialization for 'fglrx_pci_table')
/var/tmp/portage/x11-drivers/ati-drivers-8.32.5/work/common/lib/modules/fglrx/build_mod/firegl_public.c:676: attention : éléments en excès dans l'initialisation d'un scalaire
/var/tmp/portage/x11-drivers/ati-drivers-8.32.5/work/common/lib/modules/fglrx/build_mod/firegl_public.c:676: attention : (near initialization for 'fglrx_pci_table')
/var/tmp/portage/x11-drivers/ati-drivers-8.32.5/work/common/lib/modules/fglrx/build_mod/firegl_public.c:677: erreur: nom de champ dans l'initialisation de quelque chose n'étant ni un enregistrement ni une union
/var/tmp/portage/x11-drivers/ati-drivers-8.32.5/work/common/lib/modules/fglrx/build_mod/firegl_public.c:677: erreur: (near initialization for 'fglrx_pci_table')
/var/tmp/portage/x11-drivers/ati-drivers-8.32.5/work/common/lib/modules/fglrx/build_mod/firegl_public.c:677: attention : éléments en excès dans l'initialisation d'un scalaire
/var/tmp/portage/x11-drivers/ati-drivers-8.32.5/work/common/lib/modules/fglrx/build_mod/firegl_public.c:677: attention : (near initialization for 'fglrx_pci_table')
/var/tmp/portage/x11-drivers/ati-drivers-8.32.5/work/common/lib/modules/fglrx/build_mod/firegl_public.c:678: erreur: nom de champ dans l'initialisation de quelque chose n'étant ni un enregistrement ni une union
/var/tmp/portage/x11-drivers/ati-drivers-8.32.5/work/common/lib/modules/fglrx/build_mod/firegl_public.c:678: erreur: (near initialization for 'fglrx_pci_table')
/var/tmp/portage/x11-drivers/ati-drivers-8.32.5/work/common/lib/modules/fglrx/build_mod/firegl_public.c:678: attention : éléments en excès dans l'initialisation d'un scalaire
/var/tmp/portage/x11-drivers/ati-drivers-8.32.5/work/common/lib/modules/fglrx/build_mod/firegl_public.c:678: attention : (near initialization for 'fglrx_pci_table')
/var/tmp/portage/x11-drivers/ati-drivers-8.32.5/work/common/lib/modules/fglrx/build_mod/firegl_public.c:679: erreur: nom de champ dans l'initialisation de quelque chose n'étant ni un enregistrement ni une union
/var/tmp/portage/x11-drivers/ati-drivers-8.32.5/work/common/lib/modules/fglrx/build_mod/firegl_public.c:679: erreur: (near initialization for 'fglrx_pci_table')
/var/tmp/portage/x11-drivers/ati-drivers-8.32.5/work/common/lib/modules/fglrx/build_mod/firegl_public.c:679: attention : éléments en excès dans l'initialisation d'un scalaire
/var/tmp/portage/x11-drivers/ati-drivers-8.32.5/work/common/lib/modules/fglrx/build_mod/firegl_public.c:679: attention : (near initialization for 'fglrx_pci_table')
/var/tmp/portage/x11-drivers/ati-drivers-8.32.5/work/common/lib/modules/fglrx/build_mod/firegl_public.c:681: attention : accolades autour d'une initialisation de scalaire
/var/tmp/portage/x11-drivers/ati-drivers-8.32.5/work/common/lib/modules/fglrx/build_mod/firegl_public.c:681: attention : (near initialization for 'fglrx_pci_table')
/var/tmp/portage/x11-drivers/ati-drivers-8.32.5/work/common/lib/modules/fglrx/build_mod/firegl_public.c:681: attention : éléments en excès dans l'initialisation d'un scalaire
/var/tmp/portage/x11-drivers/ati-drivers-8.32.5/work/common/lib/modules/fglrx/build_mod/firegl_public.c:681: attention : (near initialization for 'fglrx_pci_table')
/var/tmp/portage/x11-drivers/ati-drivers-8.32.5/work/common/lib/modules/fglrx/build_mod/firegl_public.c:685: erreur: expected '=', ',', ';', 'asm' or '__attribute__' before '{' token
/var/tmp/portage/x11-drivers/ati-drivers-8.32.5/work/common/lib/modules/fglrx/build_mod/firegl_public.c:699: erreur: expected '=', ',', ';', 'asm' or '__attribute__' before '{' token
/var/tmp/portage/x11-drivers/ati-drivers-8.32.5/work/common/lib/modules/fglrx/build_mod/firegl_public.c:733: erreur: expected '=', ',', ';', 'asm' or '__attribute__' before '{' token
/var/tmp/portage/x11-drivers/ati-drivers-8.32.5/work/common/lib/modules/fglrx/build_mod/firegl_public.c:767: erreur: storage class specified for parameter 'fglrx_pci_driver'
/var/tmp/portage/x11-drivers/ati-drivers-8.32.5/work/common/lib/modules/fglrx/build_mod/firegl_public.c:767: erreur: parameter 'fglrx_pci_driver' is initialized
/var/tmp/portage/x11-drivers/ati-drivers-8.32.5/work/common/lib/modules/fglrx/build_mod/firegl_public.c:771: erreur: 'fglrx_pci_probe' undeclared (first use in this function)
/var/tmp/portage/x11-drivers/ati-drivers-8.32.5/work/common/lib/modules/fglrx/build_mod/firegl_public.c:773: erreur: 'fglrx_pci_suspend' undeclared (first use in this function)
/var/tmp/portage/x11-drivers/ati-drivers-8.32.5/work/common/lib/modules/fglrx/build_mod/firegl_public.c:774: erreur: 'fglrx_pci_resume' undeclared (first use in this function)
/var/tmp/portage/x11-drivers/ati-drivers-8.32.5/work/common/lib/modules/fglrx/build_mod/firegl_public.c:783: erreur: expected '=', ',', ';', 'asm' or '__attribute__' before '{' token
/var/tmp/portage/x11-drivers/ati-drivers-8.32.5/work/common/lib/modules/fglrx/build_mod/firegl_public.c:872: erreur: expected '=', ',', ';', 'asm' or '__attribute__' before '{' token
/var/tmp/portage/x11-drivers/ati-drivers-8.32.5/work/common/lib/modules/fglrx/build_mod/firegl_public.c:902: erreur: expected '=', ',', ';', 'asm' or '__attribute__' before '{' token
/var/tmp/portage/x11-drivers/ati-drivers-8.32.5/work/common/lib/modules/fglrx/build_mod/firegl_public.c:902: erreur: 'init_module' defined both normally and as an alias
/var/tmp/portage/x11-drivers/ati-drivers-8.32.5/work/common/lib/modules/fglrx/build_mod/firegl_public.c:902: erreur: expected declaration specifiers before ';' token
/var/tmp/portage/x11-drivers/ati-drivers-8.32.5/work/common/lib/modules/fglrx/build_mod/firegl_public.c:903: erreur: expected '=', ',', ';', 'asm' or '__attribute__' before '{' token
/var/tmp/portage/x11-drivers/ati-drivers-8.32.5/work/common/lib/modules/fglrx/build_mod/firegl_public.c:903: erreur: 'cleanup_module' defined both normally and as an alias
/var/tmp/portage/x11-drivers/ati-drivers-8.32.5/work/common/lib/modules/fglrx/build_mod/firegl_public.c:903: erreur: expected declaration specifiers before ';' token
/var/tmp/portage/x11-drivers/ati-drivers-8.32.5/work/common/lib/modules/fglrx/build_mod/firegl_public.c:909: erreur: expected '=', ',', ';', 'asm' or '__attribute__' before '{' token
/var/tmp/portage/x11-drivers/ati-drivers-8.32.5/work/common/lib/modules/fglrx/build_mod/firegl_public.c:922: erreur: expected '=', ',', ';', 'asm' or '__attribute__' before '{' token
/var/tmp/portage/x11-drivers/ati-drivers-8.32.5/work/common/lib/modules/fglrx/build_mod/firegl_public.c:928: erreur: expected '=', ',', ';', 'asm' or '__attribute__' before '{' token
/var/tmp/portage/x11-drivers/ati-drivers-8.32.5/work/common/lib/modules/fglrx/build_mod/firegl_public.c:936: erreur: expected '=', ',', ';', 'asm' or '__attribute__' before '{' token
/var/tmp/portage/x11-drivers/ati-drivers-8.32.5/work/common/lib/modules/fglrx/build_mod/firegl_public.c:942: erreur: expected '=', ',', ';', 'asm' or '__attribute__' before '{' token
/var/tmp/portage/x11-drivers/ati-drivers-8.32.5/work/common/lib/modules/fglrx/build_mod/firegl_public.c:947: erreur: expected '=', ',', ';', 'asm' or '__attribute__' before '{' token
/var/tmp/portage/x11-drivers/ati-drivers-8.32.5/work/common/lib/modules/fglrx/build_mod/firegl_public.c:971: erreur: expected '=', ',', ';', 'asm' or '__attribute__' before '{' token
/var/tmp/portage/x11-drivers/ati-drivers-8.32.5/work/common/lib/modules/fglrx/build_mod/firegl_public.c:978: erreur: expected '=', ',', ';', 'asm' or '__attribute__' before '{' token
/var/tmp/portage/x11-drivers/ati-drivers-8.32.5/work/common/lib/modules/fglrx/build_mod/firegl_public.c:983: erreur: expected '=', ',', ';', 'asm' or '__attribute__' before '{' token
/var/tmp/portage/x11-drivers/ati-drivers-8.32.5/work/common/lib/modules/fglrx/build_mod/firegl_public.c:988: erreur: expected '=', ',', ';', 'asm' or '__attribute__' before '{' token
/var/tmp/portage/x11-drivers/ati-drivers-8.32.5/work/common/lib/modules/fglrx/build_mod/firegl_public.c:994: erreur: expected '=', ',', ';', 'asm' or '__attribute__' before '{' token
/var/tmp/portage/x11-drivers/ati-drivers-8.32.5/work/common/lib/modules/fglrx/build_mod/firegl_public.c:1000: erreur: expected '=', ',', ';', 'asm' or '__attribute__' before '{' token
/var/tmp/portage/x11-drivers/ati-drivers-8.32.5/work/common/lib/modules/fglrx/build_mod/firegl_public.c:1006: erreur: expected '=', ',', ';', 'asm' or '__attribute__' before '{' token
/var/tmp/portage/x11-drivers/ati-drivers-8.32.5/work/common/lib/modules/fglrx/build_mod/firegl_public.c:1011: erreur: expected '=', ',', ';', 'asm' or '__attribute__' before '{' token
/var/tmp/portage/x11-drivers/ati-drivers-8.32.5/work/common/lib/modules/fglrx/build_mod/firegl_public.c:1016: erreur: expected '=', ',', ';', 'asm' or '__attribute__' before '{' token
/var/tmp/portage/x11-drivers/ati-drivers-8.32.5/work/common/lib/modules/fglrx/build_mod/firegl_public.c:1021: erreur: expected '=', ',', ';', 'asm' or '__attribute__' before '{' token
/var/tmp/portage/x11-drivers/ati-drivers-8.32.5/work/common/lib/modules/fglrx/build_mod/firegl_public.c:1031: erreur: expected '=', ',', ';', 'asm' or '__attribute__' before '{' token
/var/tmp/portage/x11-drivers/ati-drivers-8.32.5/work/common/lib/modules/fglrx/build_mod/firegl_public.c:1036: erreur: expected '=', ',', ';', 'asm' or '__attribute__' before '{' token
/var/tmp/portage/x11-drivers/ati-drivers-8.32.5/work/common/lib/modules/fglrx/build_mod/firegl_public.c:1041: erreur: expected '=', ',', ';', 'asm' or '__attribute__' before '{' token
/var/tmp/portage/x11-drivers/ati-drivers-8.32.5/work/common/lib/modules/fglrx/build_mod/firegl_public.c:1082: erreur: expected '=', ',', ';', 'asm' or '__attribute__' before '{' token
/var/tmp/portage/x11-drivers/ati-drivers-8.32.5/work/common/lib/modules/fglrx/build_mod/firegl_public.c:1094: erreur: expected '=', ',', ';', 'asm' or '__attribute__' before '{' token
/var/tmp/portage/x11-drivers/ati-drivers-8.32.5/work/common/lib/modules/fglrx/build_mod/firegl_public.c:1099: erreur: expected '=', ',', ';', 'asm' or '__attribute__' before '{' token
/var/tmp/portage/x11-drivers/ati-drivers-8.32.5/work/common/lib/modules/fglrx/build_mod/firegl_public.c:1106: erreur: expected '=', ',', ';', 'asm' or '__attribute__' before '{' token
/var/tmp/portage/x11-drivers/ati-drivers-8.32.5/work/common/lib/modules/fglrx/build_mod/firegl_public.c:1117: erreur: expected '=', ',', ';', 'asm' or '__attribute__' before '{' token
/var/tmp/portage/x11-drivers/ati-drivers-8.32.5/work/common/lib/modules/fglrx/build_mod/firegl_public.c:1122: erreur: expected '=', ',', ';', 'asm' or '__attribute__' before '{' token
/var/tmp/portage/x11-drivers/ati-drivers-8.32.5/work/common/lib/modules/fglrx/build_mod/firegl_public.c:1131: erreur: expected '=', ',', ';', 'asm' or '__attribute__' before '{' token
/var/tmp/portage/x11-drivers/ati-drivers-8.32.5/work/common/lib/modules/fglrx/build_mod/firegl_public.c:1136: erreur: expected '=', ',', ';', 'asm' or '__attribute__' before '{' token
/var/tmp/portage/x11-drivers/ati-drivers-8.32.5/work/common/lib/modules/fglrx/build_mod/firegl_public.c:1141: erreur: expected '=', ',', ';', 'asm' or '__attribute__' before '{' token
/var/tmp/portage/x11-drivers/ati-drivers-8.32.5/work/common/lib/modules/fglrx/build_mod/firegl_public.c:1146: erreur: expected '=', ',', ';', 'asm' or '__attribute__' before '{' token
/var/tmp/portage/x11-drivers/ati-drivers-8.32.5/work/common/lib/modules/fglrx/build_mod/firegl_public.c:1151: erreur: expected '=', ',', ';', 'asm' or '__attribute__' before '{' token
/var/tmp/portage/x11-drivers/ati-drivers-8.32.5/work/common/lib/modules/fglrx/build_mod/firegl_public.c:1156: erreur: expected '=', ',', ';', 'asm' or '__attribute__' before '{' token
/var/tmp/portage/x11-drivers/ati-drivers-8.32.5/work/common/lib/modules/fglrx/build_mod/firegl_public.c:1163: erreur: expected '=', ',', ';', 'asm' or '__attribute__' before '{' token
/var/tmp/portage/x11-drivers/ati-drivers-8.32.5/work/common/lib/modules/fglrx/build_mod/firegl_public.c:1168: erreur: expected '=', ',', ';', 'asm' or '__attribute__' before '{' token
/var/tmp/portage/x11-drivers/ati-drivers-8.32.5/work/common/lib/modules/fglrx/build_mod/firegl_public.c:1175: erreur: expected '=', ',', ';', 'asm' or '__attribute__' before '{' token
/var/tmp/portage/x11-drivers/ati-drivers-8.32.5/work/common/lib/modules/fglrx/build_mod/firegl_public.c:1180: erreur: expected '=', ',', ';', 'asm' or '__attribute__' before '{' token
/var/tmp/portage/x11-drivers/ati-drivers-8.32.5/work/common/lib/modules/fglrx/build_mod/firegl_public.c:1216: erreur: expected '=', ',', ';', 'asm' or '__attribute__' before '{' token
/var/tmp/portage/x11-drivers/ati-drivers-8.32.5/work/common/lib/modules/fglrx/build_mod/firegl_public.c:1221: erreur: expected '=', ',', ';', 'asm' or '__attribute__' before '{' token
/var/tmp/portage/x11-drivers/ati-drivers-8.32.5/work/common/lib/modules/fglrx/build_mod/firegl_public.c:1229: erreur: expected '=', ',', ';', 'asm' or '__attribute__' before '{' token
/var/tmp/portage/x11-drivers/ati-drivers-8.32.5/work/common/lib/modules/fglrx/build_mod/firegl_public.c:1234: erreur: expected '=', ',', ';', 'asm' or '__attribute__' before '{' token
/var/tmp/portage/x11-drivers/ati-drivers-8.32.5/work/common/lib/modules/fglrx/build_mod/firegl_public.c:1239: erreur: expected '=', ',', ';', 'asm' or '__attribute__' before '{' token
/var/tmp/portage/x11-drivers/ati-drivers-8.32.5/work/common/lib/modules/fglrx/build_mod/firegl_public.c:1244: erreur: expected '=', ',', ';', 'asm' or '__attribute__' before '{' token
/var/tmp/portage/x11-drivers/ati-drivers-8.32.5/work/common/lib/modules/fglrx/build_mod/firegl_public.c:1253: erreur: expected '=', ',', ';', 'asm' or '__attribute__' before '{' token
/var/tmp/portage/x11-drivers/ati-drivers-8.32.5/work/common/lib/modules/fglrx/build_mod/firegl_public.c:1259: erreur: expected '=', ',', ';', 'asm' or '__attribute__' before '{' token
/var/tmp/portage/x11-drivers/ati-drivers-8.32.5/work/common/lib/modules/fglrx/build_mod/firegl_public.c:1265: erreur: expected '=', ',', ';', 'asm' or '__attribute__' before '{' token
/var/tmp/portage/x11-drivers/ati-drivers-8.32.5/work/common/lib/modules/fglrx/build_mod/firegl_public.c:1274: erreur: expected '=', ',', ';', 'asm' or '__attribute__' before '{' token
/var/tmp/portage/x11-drivers/ati-drivers-8.32.5/work/common/lib/modules/fglrx/build_mod/firegl_public.c:1310: erreur: expected '=', ',', ';', 'asm' or '__attribute__' before '{' token
/var/tmp/portage/x11-drivers/ati-drivers-8.32.5/work/common/lib/modules/fglrx/build_mod/firegl_public.c:1318: erreur: expected '=', ',', ';', 'asm' or '__attribute__' before '{' token
/var/tmp/portage/x11-drivers/ati-drivers-8.32.5/work/common/lib/modules/fglrx/build_mod/firegl_public.c:1326: erreur: expected '=', ',', ';', 'asm' or '__attribute__' before '{' token
/var/tmp/portage/x11-drivers/ati-drivers-8.32.5/work/common/lib/modules/fglrx/build_mod/firegl_public.c:1334: erreur: expected '=', ',', ';', 'asm' or '__attribute__' before '{' token
/var/tmp/portage/x11-drivers/ati-drivers-8.32.5/work/common/lib/modules/fglrx/build_mod/firegl_public.c:1342: erreur: expected '=', ',', ';', 'asm' or '__attribute__' before '{' token
/var/tmp/portage/x11-drivers/ati-drivers-8.32.5/work/common/lib/modules/fglrx/build_mod/firegl_public.c:1348: erreur: expected '=', ',', ';', 'asm' or '__attribute__' before '{' token
/var/tmp/portage/x11-drivers/ati-drivers-8.32.5/work/common/lib/modules/fglrx/build_mod/firegl_public.c:1354: erreur: expected '=', ',', ';', 'asm' or '__attribute__' before '{' token
/var/tmp/portage/x11-drivers/ati-drivers-8.32.5/work/common/lib/modules/fglrx/build_mod/firegl_public.c:1360: erreur: expected '=', ',', ';', 'asm' or '__attribute__' before '{' token
/var/tmp/portage/x11-drivers/ati-drivers-8.32.5/work/common/lib/modules/fglrx/build_mod/firegl_public.c:1370: erreur: expected '=', ',', ';', 'asm' or '__attribute__' before '{' token
/var/tmp/portage/x11-drivers/ati-drivers-8.32.5/work/common/lib/modules/fglrx/build_mod/firegl_public.c:1379: erreur: expected '=', ',', ';', 'asm' or '__attribute__' before '{' token
/var/tmp/portage/x11-drivers/ati-drivers-8.32.5/work/common/lib/modules/fglrx/build_mod/firegl_public.c:1390: erreur: expected '=', ',', ';', 'asm' or '__attribute__' before '{' token
/var/tmp/portage/x11-drivers/ati-drivers-8.32.5/work/common/lib/modules/fglrx/build_mod/firegl_public.c:1395: erreur: expected '=', ',', ';', 'asm' or '__attribute__' before '{' token
/var/tmp/portage/x11-drivers/ati-drivers-8.32.5/work/common/lib/modules/fglrx/build_mod/firegl_public.c:1400: erreur: expected '=', ',', ';', 'asm' or '__attribute__' before '{' token
/var/tmp/portage/x11-drivers/ati-drivers-8.32.5/work/common/lib/modules/fglrx/build_mod/firegl_public.c:1405: erreur: expected '=', ',', ';', 'asm' or '__attribute__' before '{' token
/var/tmp/portage/x11-drivers/ati-drivers-8.32.5/work/common/lib/modules/fglrx/build_mod/firegl_public.c:1410: erreur: expected '=', ',', ';', 'asm' or '__attribute__' before '{' token
/var/tmp/portage/x11-drivers/ati-drivers-8.32.5/work/common/lib/modules/fglrx/build_mod/firegl_public.c:1415: erreur: expected '=', ',', ';', 'asm' or '__attribute__' before '{' token
/var/tmp/portage/x11-drivers/ati-drivers-8.32.5/work/common/lib/modules/fglrx/build_mod/firegl_public.c:1422: erreur: expected '=', ',', ';', 'asm' or '__attribute__' before '{' token
/var/tmp/portage/x11-drivers/ati-drivers-8.32.5/work/common/lib/modules/fglrx/build_mod/firegl_public.c:1427: erreur: expected '=', ',', ';', 'asm' or '__attribute__' before '{' token
/var/tmp/portage/x11-drivers/ati-drivers-8.32.5/work/common/lib/modules/fglrx/build_mod/firegl_public.c:1432: erreur: expected '=', ',', ';', 'asm' or '__attribute__' before '{' token
/var/tmp/portage/x11-drivers/ati-drivers-8.32.5/work/common/lib/modules/fglrx/build_mod/firegl_public.c:1437: erreur: expected '=', ',', ';', 'asm' or '__attribute__' before '{' token
/var/tmp/portage/x11-drivers/ati-drivers-8.32.5/work/common/lib/modules/fglrx/build_mod/firegl_public.c:1442: erreur: expected '=', ',', ';', 'asm' or '__attribute__' before '{' token
/var/tmp/portage/x11-drivers/ati-drivers-8.32.5/work/common/lib/modules/fglrx/build_mod/firegl_public.c:1447: erreur: expected '=', ',', ';', 'asm' or '__attribute__' before '{' token
/var/tmp/portage/x11-drivers/ati-drivers-8.32.5/work/common/lib/modules/fglrx/build_mod/firegl_public.c:1452: erreur: expected '=', ',', ';', 'asm' or '__attribute__' before '{' token
/var/tmp/portage/x11-drivers/ati-drivers-8.32.5/work/common/lib/modules/fglrx/build_mod/firegl_public.c:1459: erreur: expected '=', ',', ';', 'asm' or '__attribute__' before '{' token
/var/tmp/portage/x11-drivers/ati-drivers-8.32.5/work/common/lib/modules/fglrx/build_mod/firegl_public.c:1464: erreur: expected '=', ',', ';', 'asm' or '__attribute__' before '{' token
/var/tmp/portage/x11-drivers/ati-drivers-8.32.5/work/common/lib/modules/fglrx/build_mod/firegl_public.c:1469: erreur: expected '=', ',', ';', 'asm' or '__attribute__' before '{' token
/var/tmp/portage/x11-drivers/ati-drivers-8.32.5/work/common/lib/modules/fglrx/build_mod/firegl_public.c:1474: erreur: expected '=', ',', ';', 'asm' or '__attribute__' before '{' token
/var/tmp/portage/x11-drivers/ati-drivers-8.32.5/work/common/lib/modules/fglrx/build_mod/firegl_public.c:1484: erreur: storage class specified for parameter 'PFNMLOCK'
/var/tmp/portage/x11-drivers/ati-drivers-8.32.5/work/common/lib/modules/fglrx/build_mod/firegl_public.c:1485: erreur: storage class specified for parameter 'PFNMUNLOCK'
/var/tmp/portage/x11-drivers/ati-drivers-8.32.5/work/common/lib/modules/fglrx/build_mod/firegl_public.c:1489: erreur: expected '=', ',', ';', 'asm' or '__attribute__' before '{' token
/var/tmp/portage/x11-drivers/ati-drivers-8.32.5/work/common/lib/modules/fglrx/build_mod/firegl_public.c:1504: erreur: expected '=', ',', ';', 'asm' or '__attribute__' before '{' token
/var/tmp/portage/x11-drivers/ati-drivers-8.32.5/work/common/lib/modules/fglrx/build_mod/firegl_public.c:1519: erreur: storage class specified for parameter 'PFNMODIFYLDT'
/var/tmp/portage/x11-drivers/ati-drivers-8.32.5/work/common/lib/modules/fglrx/build_mod/firegl_public.c:1522: erreur: expected '=', ',', ';', 'asm' or '__attribute__' before '{' token
/var/tmp/portage/x11-drivers/ati-drivers-8.32.5/work/common/lib/modules/fglrx/build_mod/firegl_public.c:1543: erreur: expected '=', ',', ';', 'asm' or '__attribute__' before '{' token
/var/tmp/portage/x11-drivers/ati-drivers-8.32.5/work/common/lib/modules/fglrx/build_mod/firegl_public.c:1548: erreur: expected '=', ',', ';', 'asm' or '__attribute__' before '{' token
/var/tmp/portage/x11-drivers/ati-drivers-8.32.5/work/common/lib/modules/fglrx/build_mod/firegl_public.c:1555: erreur: expected '=', ',', ';', 'asm' or '__attribute__' before '{' token
/var/tmp/portage/x11-drivers/ati-drivers-8.32.5/work/common/lib/modules/fglrx/build_mod/firegl_public.c:1664: erreur: expected '=', ',', ';', 'asm' or '__attribute__' before '{' token
/var/tmp/portage/x11-drivers/ati-drivers-8.32.5/work/common/lib/modules/fglrx/build_mod/firegl_public.c:1680: erreur: expected '=', ',', ';', 'asm' or '__attribute__' before '{' token
/var/tmp/portage/x11-drivers/ati-drivers-8.32.5/work/common/lib/modules/fglrx/build_mod/firegl_public.c:1696: erreur: expected '=', ',', ';', 'asm' or '__attribute__' before '{' token
/var/tmp/portage/x11-drivers/ati-drivers-8.32.5/work/common/lib/modules/fglrx/build_mod/firegl_public.c:1701: erreur: expected '=', ',', ';', 'asm' or '__attribute__' before '{' token
/var/tmp/portage/x11-drivers/ati-drivers-8.32.5/work/common/lib/modules/fglrx/build_mod/firegl_public.c:1706: erreur: expected '=', ',', ';', 'asm' or '__attribute__' before '{' token
/var/tmp/portage/x11-drivers/ati-drivers-8.32.5/work/common/lib/modules/fglrx/build_mod/firegl_public.c:1720: erreur: expected '=', ',', ';', 'asm' or '__attribute__' before '{' token
/var/tmp/portage/x11-drivers/ati-drivers-8.32.5/work/common/lib/modules/fglrx/build_mod/firegl_public.c:1731: erreur: expected '=', ',', ';', 'asm' or '__attribute__' before '{' token
/var/tmp/portage/x11-drivers/ati-drivers-8.32.5/work/common/lib/modules/fglrx/build_mod/firegl_public.c:1736: erreur: expected '=', ',', ';', 'asm' or '__attribute__' before '{' token
/var/tmp/portage/x11-drivers/ati-drivers-8.32.5/work/common/lib/modules/fglrx/build_mod/firegl_public.c:1741: erreur: expected '=', ',', ';', 'asm' or '__attribute__' before '{' token
/var/tmp/portage/x11-drivers/ati-drivers-8.32.5/work/common/lib/modules/fglrx/build_mod/firegl_public.c:1750: erreur: expected '=', ',', ';', 'asm' or '__attribute__' before '{' token
/var/tmp/portage/x11-drivers/ati-drivers-8.32.5/work/common/lib/modules/fglrx/build_mod/firegl_public.c:1762: erreur: expected '=', ',', ';', 'asm' or '__attribute__' before '{' token
/var/tmp/portage/x11-drivers/ati-drivers-8.32.5/work/common/lib/modules/fglrx/build_mod/firegl_public.c:1782: erreur: expected '=', ',', ';', 'asm' or '__attribute__' before '{' token
/var/tmp/portage/x11-drivers/ati-drivers-8.32.5/work/common/lib/modules/fglrx/build_mod/firegl_public.c:1793: erreur: expected '=', ',', ';', 'asm' or '__attribute__' before '{' token
/var/tmp/portage/x11-drivers/ati-drivers-8.32.5/work/common/lib/modules/fglrx/build_mod/firegl_public.c:1798: erreur: expected '=', ',', ';', 'asm' or '__attribute__' before '{' token
/var/tmp/portage/x11-drivers/ati-drivers-8.32.5/work/common/lib/modules/fglrx/build_mod/firegl_public.c:1803: erreur: expected '=', ',', ';', 'asm' or '__attribute__' before '{' token
/var/tmp/portage/x11-drivers/ati-drivers-8.32.5/work/common/lib/modules/fglrx/build_mod/firegl_public.c:1808: erreur: expected '=', ',', ';', 'asm' or '__attribute__' before '{' token
/var/tmp/portage/x11-drivers/ati-drivers-8.32.5/work/common/lib/modules/fglrx/build_mod/firegl_public.c:1813: erreur: expected '=', ',', ';', 'asm' or '__attribute__' before '{' token
/var/tmp/portage/x11-drivers/ati-drivers-8.32.5/work/common/lib/modules/fglrx/build_mod/firegl_public.c:1818: erreur: expected '=', ',', ';', 'asm' or '__attribute__' before '{' token
/var/tmp/portage/x11-drivers/ati-drivers-8.32.5/work/common/lib/modules/fglrx/build_mod/firegl_public.c:1822: erreur: expected '=', ',', ';', 'asm' or '__attribute__' before '{' token
/var/tmp/portage/x11-drivers/ati-drivers-8.32.5/work/common/lib/modules/fglrx/build_mod/firegl_public.c:1826: erreur: expected '=', ',', ';', 'asm' or '__attribute__' before '{' token
/var/tmp/portage/x11-drivers/ati-drivers-8.32.5/work/common/lib/modules/fglrx/build_mod/firegl_public.c:1831: erreur: expected '=', ',', ';', 'asm' or '__attribute__' before '{' token
/var/tmp/portage/x11-drivers/ati-drivers-8.32.5/work/common/lib/modules/fglrx/build_mod/firegl_public.c:1836: erreur: expected '=', ',', ';', 'asm' or '__attribute__' before '{' token
/var/tmp/portage/x11-drivers/ati-drivers-8.32.5/work/common/lib/modules/fglrx/build_mod/firegl_public.c:1841: erreur: expected '=', ',', ';', 'asm' or '__attribute__' before '{' token
/var/tmp/portage/x11-drivers/ati-drivers-8.32.5/work/common/lib/modules/fglrx/build_mod/firegl_public.c:1846: erreur: expected '=', ',', ';', 'asm' or '__attribute__' before '{' token
/var/tmp/portage/x11-drivers/ati-drivers-8.32.5/work/common/lib/modules/fglrx/build_mod/firegl_public.c:1851: erreur: expected '=', ',', ';', 'asm' or '__attribute__' before '{' token
/var/tmp/portage/x11-drivers/ati-drivers-8.32.5/work/common/lib/modules/fglrx/build_mod/firegl_public.c:1856: erreur: expected '=', ',', ';', 'asm' or '__attribute__' before '{' token
/var/tmp/portage/x11-drivers/ati-drivers-8.32.5/work/common/lib/modules/fglrx/build_mod/firegl_public.c:1861: erreur: expected '=', ',', ';', 'asm' or '__attribute__' before '{' token
/var/tmp/portage/x11-drivers/ati-drivers-8.32.5/work/common/lib/modules/fglrx/build_mod/firegl_public.c:1866: erreur: expected '=', ',', ';', 'asm' or '__attribute__' before '{' token
/var/tmp/portage/x11-drivers/ati-drivers-8.32.5/work/common/lib/modules/fglrx/build_mod/firegl_public.c:1871: erreur: expected '=', ',', ';', 'asm' or '__attribute__' before '{' token
/var/tmp/portage/x11-drivers/ati-drivers-8.32.5/work/common/lib/modules/fglrx/build_mod/firegl_public.c:1880: erreur: expected '=', ',', ';', 'asm' or '__attribute__' before '{' token
/var/tmp/portage/x11-drivers/ati-drivers-8.32.5/work/common/lib/modules/fglrx/build_mod/firegl_public.c:1895: erreur: expected '=', ',', ';', 'asm' or '__attribute__' before '{' token
/var/tmp/portage/x11-drivers/ati-drivers-8.32.5/work/common/lib/modules/fglrx/build_mod/firegl_public.c:1909: erreur: expected '=', ',', ';', 'asm' or '__attribute__' before '{' token
/var/tmp/portage/x11-drivers/ati-drivers-8.32.5/work/common/lib/modules/fglrx/build_mod/firegl_public.c:1929: erreur: expected '=', ',', ';', 'asm' or '__attribute__' before '{' token
/var/tmp/portage/x11-drivers/ati-drivers-8.32.5/work/common/lib/modules/fglrx/build_mod/firegl_public.c:1951: erreur: expected '=', ',', ';', 'asm' or '__attribute__' before '{' token
/var/tmp/portage/x11-drivers/ati-drivers-8.32.5/work/common/lib/modules/fglrx/build_mod/firegl_public.c:1965: erreur: expected '=', ',', ';', 'asm' or '__attribute__' before '{' token
/var/tmp/portage/x11-drivers/ati-drivers-8.32.5/work/common/lib/modules/fglrx/build_mod/firegl_public.c:1974: erreur: expected '=', ',', ';', 'asm' or '__attribute__' before '{' token
/var/tmp/portage/x11-drivers/ati-drivers-8.32.5/work/common/lib/modules/fglrx/build_mod/firegl_public.c:1983: erreur: expected '=', ',', ';', 'asm' or '__attribute__' before '{' token
/var/tmp/portage/x11-drivers/ati-drivers-8.32.5/work/common/lib/modules/fglrx/build_mod/firegl_public.c:1989: erreur: expected '=', ',', ';', 'asm' or '__attribute__' before '{' token
/var/tmp/portage/x11-drivers/ati-drivers-8.32.5/work/common/lib/modules/fglrx/build_mod/firegl_public.c:1995: erreur: expected '=', ',', ';', 'asm' or '__attribute__' before '{' token
/var/tmp/portage/x11-drivers/ati-drivers-8.32.5/work/common/lib/modules/fglrx/build_mod/firegl_public.c:2007: erreur: expected '=', ',', ';', 'asm' or '__attribute__' before '{' token
/var/tmp/portage/x11-drivers/ati-drivers-8.32.5/work/common/lib/modules/fglrx/build_mod/firegl_public.c:2012: erreur: expected '=', ',', ';', 'asm' or '__attribute__' before '{' token
/var/tmp/portage/x11-drivers/ati-drivers-8.32.5/work/common/lib/modules/fglrx/build_mod/firegl_public.c:2017: erreur: expected '=', ',', ';', 'asm' or '__attribute__' before '{' token
/var/tmp/portage/x11-drivers/ati-drivers-8.32.5/work/common/lib/modules/fglrx/build_mod/firegl_public.c:2022: erreur: expected '=', ',', ';', 'asm' or '__attribute__' before '{' token
/var/tmp/portage/x11-drivers/ati-drivers-8.32.5/work/common/lib/modules/fglrx/build_mod/firegl_public.c:2027: erreur: expected '=', ',', ';', 'asm' or '__attribute__' before '{' token
/var/tmp/portage/x11-drivers/ati-drivers-8.32.5/work/common/lib/modules/fglrx/build_mod/firegl_public.c:2032: erreur: expected '=', ',', ';', 'asm' or '__attribute__' before '{' token
/var/tmp/portage/x11-drivers/ati-drivers-8.32.5/work/common/lib/modules/fglrx/build_mod/firegl_public.c:2037: erreur: expected '=', ',', ';', 'asm' or '__attribute__' before '{' token
/var/tmp/portage/x11-drivers/ati-drivers-8.32.5/work/common/lib/modules/fglrx/build_mod/firegl_public.c:2042: erreur: expected '=', ',', ';', 'asm' or '__attribute__' before '{' token
/var/tmp/portage/x11-drivers/ati-drivers-8.32.5/work/common/lib/modules/fglrx/build_mod/firegl_public.c:2062: erreur: expected '=', ',', ';', 'asm' or '__attribute__' before '{' token
/var/tmp/portage/x11-drivers/ati-drivers-8.32.5/work/common/lib/modules/fglrx/build_mod/firegl_public.c:2094: erreur: expected '=', ',', ';', 'asm' or '__attribute__' before '{' token
/var/tmp/portage/x11-drivers/ati-drivers-8.32.5/work/common/lib/modules/fglrx/build_mod/firegl_public.c:2109: erreur: expected '=', ',', ';', 'asm' or '__attribute__' before '{' token
/var/tmp/portage/x11-drivers/ati-drivers-8.32.5/work/common/lib/modules/fglrx/build_mod/firegl_public.c:2186: erreur: expected '=', ',', ';', 'asm' or '__attribute__' before '{' token
/var/tmp/portage/x11-drivers/ati-drivers-8.32.5/work/common/lib/modules/fglrx/build_mod/firegl_public.c:2209: erreur: expected '=', ',', ';', 'asm' or '__attribute__' before '{' token
/var/tmp/portage/x11-drivers/ati-drivers-8.32.5/work/common/lib/modules/fglrx/build_mod/firegl_public.c:2214: erreur: expected '=', ',', ';', 'asm' or '__attribute__' before '{' token
/var/tmp/portage/x11-drivers/ati-drivers-8.32.5/work/common/lib/modules/fglrx/build_mod/firegl_public.c:2219: erreur: expected '=', ',', ';', 'asm' or '__attribute__' before '{' token
/var/tmp/portage/x11-drivers/ati-drivers-8.32.5/work/common/lib/modules/fglrx/build_mod/firegl_public.c:2224: erreur: expected '=', ',', ';', 'asm' or '__attribute__' before '{' token
/var/tmp/portage/x11-drivers/ati-drivers-8.32.5/work/common/lib/modules/fglrx/build_mod/firegl_public.c:2229: erreur: expected '=', ',', ';', 'asm' or '__attribute__' before '{' token
/var/tmp/portage/x11-drivers/ati-drivers-8.32.5/work/common/lib/modules/fglrx/build_mod/firegl_public.c:2234: erreur: expected '=', ',', ';', 'asm' or '__attribute__' before '{' token
/var/tmp/portage/x11-drivers/ati-drivers-8.32.5/work/common/lib/modules/fglrx/build_mod/firegl_public.c:2239: erreur: expected '=', ',', ';', 'asm' or '__attribute__' before '{' token
/var/tmp/portage/x11-drivers/ati-drivers-8.32.5/work/common/lib/modules/fglrx/build_mod/firegl_public.c:2244: erreur: expected '=', ',', ';', 'asm' or '__attribute__' before '{' token
/var/tmp/portage/x11-drivers/ati-drivers-8.32.5/work/common/lib/modules/fglrx/build_mod/firegl_public.c:2249: erreur: expected '=', ',', ';', 'asm' or '__attribute__' before '{' token
/var/tmp/portage/x11-drivers/ati-drivers-8.32.5/work/common/lib/modules/fglrx/build_mod/firegl_public.c:2260: erreur: expected '=', ',', ';', 'asm' or '__attribute__' before '{' token
/var/tmp/portage/x11-drivers/ati-drivers-8.32.5/work/common/lib/modules/fglrx/build_mod/firegl_public.c:2273: erreur: expected '=', ',', ';', 'asm' or '__attribute__' before '{' token
/var/tmp/portage/x11-drivers/ati-drivers-8.32.5/work/common/lib/modules/fglrx/build_mod/firegl_public.c:2278: erreur: expected '=', ',', ';', 'asm' or '__attribute__' before '{' token
/var/tmp/portage/x11-drivers/ati-drivers-8.32.5/work/common/lib/modules/fglrx/build_mod/firegl_public.c:2283: erreur: expected '=', ',', ';', 'asm' or '__attribute__' before '{' token
/var/tmp/portage/x11-drivers/ati-drivers-8.32.5/work/common/lib/modules/fglrx/build_mod/firegl_public.c:2288: erreur: expected '=', ',', ';', 'asm' or '__attribute__' before '{' token
/var/tmp/portage/x11-drivers/ati-drivers-8.32.5/work/common/lib/modules/fglrx/build_mod/firegl_public.c:2293: erreur: expected '=', ',', ';', 'asm' or '__attribute__' before '{' token
/var/tmp/portage/x11-drivers/ati-drivers-8.32.5/work/common/lib/modules/fglrx/build_mod/firegl_public.c:2298: erreur: expected '=', ',', ';', 'asm' or '__attribute__' before '{' token
/var/tmp/portage/x11-drivers/ati-drivers-8.32.5/work/common/lib/modules/fglrx/build_mod/firegl_public.c:2303: erreur: expected '=', ',', ';', 'asm' or '__attribute__' before '{' token
/var/tmp/portage/x11-drivers/ati-drivers-8.32.5/work/common/lib/modules/fglrx/build_mod/firegl_public.c:2328: erreur: expected '=', ',', ';', 'asm' or '__attribute__' before '{' token
/var/tmp/portage/x11-drivers/ati-drivers-8.32.5/work/common/lib/modules/fglrx/build_mod/firegl_public.c:2364: erreur: expected '=', ',', ';', 'asm' or '__attribute__' before '{' token
/var/tmp/portage/x11-drivers/ati-drivers-8.32.5/work/common/lib/modules/fglrx/build_mod/firegl_public.c:2373: erreur: expected '=', ',', ';', 'asm' or '__attribute__' before '{' token
/var/tmp/portage/x11-drivers/ati-drivers-8.32.5/work/common/lib/modules/fglrx/build_mod/firegl_public.c:2382: erreur: expected '=', ',', ';', 'asm' or '__attribute__' before '{' token
/var/tmp/portage/x11-drivers/ati-drivers-8.32.5/work/common/lib/modules/fglrx/build_mod/firegl_public.c:2391: erreur: expected '=', ',', ';', 'asm' or '__attribute__' before '{' token
/var/tmp/portage/x11-drivers/ati-drivers-8.32.5/work/common/lib/modules/fglrx/build_mod/firegl_public.c:2406: erreur: expected '=', ',', ';', 'asm' or '__attribute__' before '{' token
/var/tmp/portage/x11-drivers/ati-drivers-8.32.5/work/common/lib/modules/fglrx/build_mod/firegl_public.c:2415: erreur: expected '=', ',', ';', 'asm' or '__attribute__' before '{' token
/var/tmp/portage/x11-drivers/ati-drivers-8.32.5/work/common/lib/modules/fglrx/build_mod/firegl_public.c:2423: erreur: expected '=', ',', ';', 'asm' or '__attribute__' before '{' token
/var/tmp/portage/x11-drivers/ati-drivers-8.32.5/work/common/lib/modules/fglrx/build_mod/firegl_public.c:2428: erreur: expected '=', ',', ';', 'asm' or '__attribute__' before '{' token
/var/tmp/portage/x11-drivers/ati-drivers-8.32.5/work/common/lib/modules/fglrx/build_mod/firegl_public.c:2433: erreur: expected '=', ',', ';', 'asm' or '__attribute__' before '{' token
/var/tmp/portage/x11-drivers/ati-drivers-8.32.5/work/common/lib/modules/fglrx/build_mod/firegl_public.c:2438: erreur: expected '=', ',', ';', 'asm' or '__attribute__' before '{' token
/var/tmp/portage/x11-drivers/ati-drivers-8.32.5/work/common/lib/modules/fglrx/build_mod/firegl_public.c:2443: erreur: expected '=', ',', ';', 'asm' or '__attribute__' before '{' token
/var/tmp/portage/x11-drivers/ati-drivers-8.32.5/work/common/lib/modules/fglrx/build_mod/firegl_public.c:2448: erreur: expected '=', ',', ';', 'asm' or '__attribute__' before '{' token
/var/tmp/portage/x11-drivers/ati-drivers-8.32.5/work/common/lib/modules/fglrx/build_mod/firegl_public.c:2453: erreur: expected '=', ',', ';', 'asm' or '__attribute__' before '{' token
/var/tmp/portage/x11-drivers/ati-drivers-8.32.5/work/common/lib/modules/fglrx/build_mod/firegl_public.c:2458: erreur: expected '=', ',', ';', 'asm' or '__attribute__' before '{' token
/var/tmp/portage/x11-drivers/ati-drivers-8.32.5/work/common/lib/modules/fglrx/build_mod/firegl_public.c:2464: erreur: expected '=', ',', ';', 'asm' or '__attribute__' before '{' token
/var/tmp/portage/x11-drivers/ati-drivers-8.32.5/work/common/lib/modules/fglrx/build_mod/firegl_public.c:2469: erreur: expected '=', ',', ';', 'asm' or '__attribute__' before '{' token
/var/tmp/portage/x11-drivers/ati-drivers-8.32.5/work/common/lib/modules/fglrx/build_mod/firegl_public.c:2474: erreur: expected '=', ',', ';', 'asm' or '__attribute__' before '{' token
/var/tmp/portage/x11-drivers/ati-drivers-8.32.5/work/common/lib/modules/fglrx/build_mod/firegl_public.c:2479: erreur: expected '=', ',', ';', 'asm' or '__attribute__' before '{' token
/var/tmp/portage/x11-drivers/ati-drivers-8.32.5/work/common/lib/modules/fglrx/build_mod/firegl_public.c:2487: erreur: expected '=', ',', ';', 'asm' or '__attribute__' before '{' token
/var/tmp/portage/x11-drivers/ati-drivers-8.32.5/work/common/lib/modules/fglrx/build_mod/firegl_public.c:2492: erreur: expected '=', ',', ';', 'asm' or '__attribute__' before '{' token
/var/tmp/portage/x11-drivers/ati-drivers-8.32.5/work/common/lib/modules/fglrx/build_mod/firegl_public.c:2497: erreur: expected '=', ',', ';', 'asm' or '__attribute__' before '{' token
/var/tmp/portage/x11-drivers/ati-drivers-8.32.5/work/common/lib/modules/fglrx/build_mod/firegl_public.c:2502: erreur: expected '=', ',', ';', 'asm' or '__attribute__' before '{' token
/var/tmp/portage/x11-drivers/ati-drivers-8.32.5/work/common/lib/modules/fglrx/build_mod/firegl_public.c:2507: erreur: expected '=', ',', ';', 'asm' or '__attribute__' before '{' token
/var/tmp/portage/x11-drivers/ati-drivers-8.32.5/work/common/lib/modules/fglrx/build_mod/firegl_public.c:2512: erreur: expected '=', ',', ';', 'asm' or '__attribute__' before '{' token
/var/tmp/portage/x11-drivers/ati-drivers-8.32.5/work/common/lib/modules/fglrx/build_mod/firegl_public.c:2517: erreur: expected '=', ',', ';', 'asm' or '__attribute__' before '{' token
/var/tmp/portage/x11-drivers/ati-drivers-8.32.5/work/common/lib/modules/fglrx/build_mod/firegl_public.c:2525: erreur: expected '=', ',', ';', 'asm' or '__attribute__' before '{' token
/var/tmp/portage/x11-drivers/ati-drivers-8.32.5/work/common/lib/modules/fglrx/build_mod/firegl_public.c:2530: erreur: expected '=', ',', ';', 'asm' or '__attribute__' before '{' token
/var/tmp/portage/x11-drivers/ati-drivers-8.32.5/work/common/lib/modules/fglrx/build_mod/firegl_public.c:2549: erreur: storage class specified for parameter 'irq_handler_func'
/var/tmp/portage/x11-drivers/ati-drivers-8.32.5/work/common/lib/modules/fglrx/build_mod/firegl_public.c:2552: erreur: expected '=', ',', ';', 'asm' or '__attribute__' before '{' token
/var/tmp/portage/x11-drivers/ati-drivers-8.32.5/work/common/lib/modules/fglrx/build_mod/firegl_public.c:2560: erreur: expected '=', ',', ';', 'asm' or '__attribute__' before '{' token
/var/tmp/portage/x11-drivers/ati-drivers-8.32.5/work/common/lib/modules/fglrx/build_mod/firegl_public.c:2568: erreur: expected '=', ',', ';', 'asm' or '__attribute__' before '{' token
/var/tmp/portage/x11-drivers/ati-drivers-8.32.5/work/common/lib/modules/fglrx/build_mod/firegl_public.c:2576: erreur: expected '=', ',', ';', 'asm' or '__attribute__' before '{' token
/var/tmp/portage/x11-drivers/ati-drivers-8.32.5/work/common/lib/modules/fglrx/build_mod/firegl_public.c:2585: erreur: expected '=', ',', ';', 'asm' or '__attribute__' before '{' token
/var/tmp/portage/x11-drivers/ati-drivers-8.32.5/work/common/lib/modules/fglrx/build_mod/firegl_public.c:2596: erreur: expected '=', ',', ';', 'asm' or '__attribute__' before '{' token
/var/tmp/portage/x11-drivers/ati-drivers-8.32.5/work/common/lib/modules/fglrx/build_mod/firegl_public.c:2602: erreur: expected '=', ',', ';', 'asm' or '__attribute__' before '{' token
/var/tmp/portage/x11-drivers/ati-drivers-8.32.5/work/common/lib/modules/fglrx/build_mod/firegl_public.c:2619: erreur: storage class specified for parameter 'mem_map_t'
/var/tmp/portage/x11-drivers/ati-drivers-8.32.5/work/common/lib/modules/fglrx/build_mod/firegl_public.c:2620: erreur: expected '=', ',', ';', 'asm' or '__attribute__' before '*' token
/var/tmp/portage/x11-drivers/ati-drivers-8.32.5/work/common/lib/modules/fglrx/build_mod/firegl_public.c:2625: erreur: expected '=', ',', ';', 'asm' or '__attribute__' before 'do_vm_nopage'
/var/tmp/portage/x11-drivers/ati-drivers-8.32.5/work/common/lib/modules/fglrx/build_mod/firegl_public.c:2661: erreur: expected '=', ',', ';', 'asm' or '__attribute__' before 'do_vm_shm_nopage'
/var/tmp/portage/x11-drivers/ati-drivers-8.32.5/work/common/lib/modules/fglrx/build_mod/firegl_public.c:2747: erreur: expected '=', ',', ';', 'asm' or '__attribute__' before 'do_vm_dma_nopage'
/var/tmp/portage/x11-drivers/ati-drivers-8.32.5/work/common/lib/modules/fglrx/build_mod/firegl_public.c:2787: erreur: expected '=', ',', ';', 'asm' or '__attribute__' before 'do_vm_kmap_nopage'
/var/tmp/portage/x11-drivers/ati-drivers-8.32.5/work/common/lib/modules/fglrx/build_mod/firegl_public.c:2825: erreur: expected '=', ',', ';', 'asm' or '__attribute__' before 'do_vm_pcie_nopage'
/var/tmp/portage/x11-drivers/ati-drivers-8.32.5/work/common/lib/modules/fglrx/build_mod/firegl_public.c:2877: erreur: expected '=', ',', ';', 'asm' or '__attribute__' before 'do_vm_gart_nopage'
/var/tmp/portage/x11-drivers/ati-drivers-8.32.5/work/common/lib/modules/fglrx/build_mod/firegl_public.c:2900: erreur: expected '=', ',', ';', 'asm' or '__attribute__' before 'vm_nopage'
/var/tmp/portage/x11-drivers/ati-drivers-8.32.5/work/common/lib/modules/fglrx/build_mod/firegl_public.c:2937: erreur: expected '=', ',', ';', 'asm' or '__attribute__' before 'vm_shm_nopage'
/var/tmp/portage/x11-drivers/ati-drivers-8.32.5/work/common/lib/modules/fglrx/build_mod/firegl_public.c:2951: erreur: expected '=', ',', ';', 'asm' or '__attribute__' before 'vm_dma_nopage'
/var/tmp/portage/x11-drivers/ati-drivers-8.32.5/work/common/lib/modules/fglrx/build_mod/firegl_public.c:2959: erreur: expected '=', ',', ';', 'asm' or '__attribute__' before 'vm_kmap_nopage'
/var/tmp/portage/x11-drivers/ati-drivers-8.32.5/work/common/lib/modules/fglrx/build_mod/firegl_public.c:2967: erreur: expected '=', ',', ';', 'asm' or '__attribute__' before 'vm_pcie_nopage'
/var/tmp/portage/x11-drivers/ati-drivers-8.32.5/work/common/lib/modules/fglrx/build_mod/firegl_public.c:2974: erreur: expected '=', ',', ';', 'asm' or '__attribute__' before 'vm_gart_nopage'
/var/tmp/portage/x11-drivers/ati-drivers-8.32.5/work/common/lib/modules/fglrx/build_mod/firegl_public.c:3062: erreur: expected '=', ',', ';', 'asm' or '__attribute__' before '{' token
/var/tmp/portage/x11-drivers/ati-drivers-8.32.5/work/common/lib/modules/fglrx/build_mod/firegl_public.c:3067: erreur: expected '=', ',', ';', 'asm' or '__attribute__' before '{' token
/var/tmp/portage/x11-drivers/ati-drivers-8.32.5/work/common/lib/modules/fglrx/build_mod/firegl_public.c:3072: erreur: expected '=', ',', ';', 'asm' or '__attribute__' before '{' token
/var/tmp/portage/x11-drivers/ati-drivers-8.32.5/work/common/lib/modules/fglrx/build_mod/firegl_public.c:3077: erreur: expected '=', ',', ';', 'asm' or '__attribute__' before '{' token
/var/tmp/portage/x11-drivers/ati-drivers-8.32.5/work/common/lib/modules/fglrx/build_mod/firegl_public.c:3086: erreur: expected '=', ',', ';', 'asm' or '__attribute__' before '{' token
/var/tmp/portage/x11-drivers/ati-drivers-8.32.5/work/common/lib/modules/fglrx/build_mod/firegl_public.c:3098: erreur: expected '=', ',', ';', 'asm' or '__attribute__' before '{' token
/var/tmp/portage/x11-drivers/ati-drivers-8.32.5/work/common/lib/modules/fglrx/build_mod/firegl_public.c:3122: erreur: expected '=', ',', ';', 'asm' or '__attribute__' before '{' token
/var/tmp/portage/x11-drivers/ati-drivers-8.32.5/work/common/lib/modules/fglrx/build_mod/firegl_public.c:3149: erreur: expected '=', ',', ';', 'asm' or '__attribute__' before '{' token
/var/tmp/portage/x11-drivers/ati-drivers-8.32.5/work/common/lib/modules/fglrx/build_mod/firegl_public.c:3165: erreur: expected '=', ',', ';', 'asm' or '__attribute__' before '{' token
/var/tmp/portage/x11-drivers/ati-drivers-8.32.5/work/common/lib/modules/fglrx/build_mod/firegl_public.c:3167: erreur: expected '=', ',', ';', 'asm' or '__attribute__' before '{' token
/var/tmp/portage/x11-drivers/ati-drivers-8.32.5/work/common/lib/modules/fglrx/build_mod/firegl_public.c:3169: erreur: storage class specified for parameter 'vm_ops'
/var/tmp/portage/x11-drivers/ati-drivers-8.32.5/work/common/lib/modules/fglrx/build_mod/firegl_public.c:3169: erreur: parameter 'vm_ops' is initialized
/var/tmp/portage/x11-drivers/ati-drivers-8.32.5/work/common/lib/modules/fglrx/build_mod/firegl_public.c:3171: erreur: 'vm_nopage' undeclared (first use in this function)
/var/tmp/portage/x11-drivers/ati-drivers-8.32.5/work/common/lib/modules/fglrx/build_mod/firegl_public.c:3172: erreur: 'ip_drm_vm_open' undeclared (first use in this function)
/var/tmp/portage/x11-drivers/ati-drivers-8.32.5/work/common/lib/modules/fglrx/build_mod/firegl_public.c:3173: erreur: 'ip_drm_vm_close' undeclared (first use in this function)
/var/tmp/portage/x11-drivers/ati-drivers-8.32.5/work/common/lib/modules/fglrx/build_mod/firegl_public.c:3187: erreur: storage class specified for parameter 'vm_shm_ops'
/var/tmp/portage/x11-drivers/ati-drivers-8.32.5/work/common/lib/modules/fglrx/build_mod/firegl_public.c:3187: erreur: parameter 'vm_shm_ops' is initialized
/var/tmp/portage/x11-drivers/ati-drivers-8.32.5/work/common/lib/modules/fglrx/build_mod/firegl_public.c:3189: erreur: 'vm_shm_nopage' undeclared (first use in this function)
/var/tmp/portage/x11-drivers/ati-drivers-8.32.5/work/common/lib/modules/fglrx/build_mod/firegl_public.c:3194: erreur: storage class specified for parameter 'vm_pci_bq_ops'
/var/tmp/portage/x11-drivers/ati-drivers-8.32.5/work/common/lib/modules/fglrx/build_mod/firegl_public.c:3194: erreur: parameter 'vm_pci_bq_ops' is initialized
/var/tmp/portage/x11-drivers/ati-drivers-8.32.5/work/common/lib/modules/fglrx/build_mod/firegl_public.c:3196: erreur: 'vm_dma_nopage' undeclared (first use in this function)
/var/tmp/portage/x11-drivers/ati-drivers-8.32.5/work/common/lib/modules/fglrx/build_mod/firegl_public.c:3201: erreur: storage class specified for parameter 'vm_ctx_ops'
/var/tmp/portage/x11-drivers/ati-drivers-8.32.5/work/common/lib/modules/fglrx/build_mod/firegl_public.c:3201: erreur: parameter 'vm_ctx_ops' is initialized
/var/tmp/portage/x11-drivers/ati-drivers-8.32.5/work/common/lib/modules/fglrx/build_mod/firegl_public.c:3208: erreur: storage class specified for parameter 'vm_pcie_ops'
/var/tmp/portage/x11-drivers/ati-drivers-8.32.5/work/common/lib/modules/fglrx/build_mod/firegl_public.c:3208: erreur: parameter 'vm_pcie_ops' is initialized
/var/tmp/portage/x11-drivers/ati-drivers-8.32.5/work/common/lib/modules/fglrx/build_mod/firegl_public.c:3210: erreur: 'vm_pcie_nopage' undeclared (first use in this function)
/var/tmp/portage/x11-drivers/ati-drivers-8.32.5/work/common/lib/modules/fglrx/build_mod/firegl_public.c:3215: erreur: storage class specified for parameter 'vm_kmap_ops'
/var/tmp/portage/x11-drivers/ati-drivers-8.32.5/work/common/lib/modules/fglrx/build_mod/firegl_public.c:3215: erreur: parameter 'vm_kmap_ops' is initialized
/var/tmp/portage/x11-drivers/ati-drivers-8.32.5/work/common/lib/modules/fglrx/build_mod/firegl_public.c:3217: erreur: 'vm_kmap_nopage' undeclared (first use in this function)
/var/tmp/portage/x11-drivers/ati-drivers-8.32.5/work/common/lib/modules/fglrx/build_mod/firegl_public.c:3222: erreur: storage class specified for parameter 'vm_gart_ops'
/var/tmp/portage/x11-drivers/ati-drivers-8.32.5/work/common/lib/modules/fglrx/build_mod/firegl_public.c:3222: erreur: parameter 'vm_gart_ops' is initialized
/var/tmp/portage/x11-drivers/ati-drivers-8.32.5/work/common/lib/modules/fglrx/build_mod/firegl_public.c:3224: erreur: 'vm_gart_nopage' undeclared (first use in this function)
/var/tmp/portage/x11-drivers/ati-drivers-8.32.5/work/common/lib/modules/fglrx/build_mod/firegl_public.c:3231: erreur: storage class specified for parameter 'vm_agp_bq_ops'
/var/tmp/portage/x11-drivers/ati-drivers-8.32.5/work/common/lib/modules/fglrx/build_mod/firegl_public.c:3231: erreur: parameter 'vm_agp_bq_ops' is initialized
/var/tmp/portage/x11-drivers/ati-drivers-8.32.5/work/common/lib/modules/fglrx/build_mod/firegl_public.c:3251: erreur: expected '=', ',', ';', 'asm' or '__attribute__' before '{' token
/var/tmp/portage/x11-drivers/ati-drivers-8.32.5/work/common/lib/modules/fglrx/build_mod/firegl_public.c:3437: erreur: parameter '__ke_agp_try_unsupported' is initialized
/var/tmp/portage/x11-drivers/ati-drivers-8.32.5/work/common/lib/modules/fglrx/build_mod/firegl_public.c:3440: erreur: storage class specified for parameter '__fgl_agp_init'
/var/tmp/portage/x11-drivers/ati-drivers-8.32.5/work/common/lib/modules/fglrx/build_mod/firegl_public.c:3441: erreur: storage class specified for parameter '__fgl_agp_cleanup'
/var/tmp/portage/x11-drivers/ati-drivers-8.32.5/work/common/lib/modules/fglrx/build_mod/firegl_public.c:3442: erreur: storage class specified for parameter '__fgl_agp_try_unsupported'
/var/tmp/portage/x11-drivers/ati-drivers-8.32.5/work/common/lib/modules/fglrx/build_mod/firegl_public.c:3443: erreur: storage class specified for parameter '__fgl_agp_allocate_memory_phys_list'
/var/tmp/portage/x11-drivers/ati-drivers-8.32.5/work/common/lib/modules/fglrx/build_mod/firegl_public.c:3459: erreur: parameter '__ke_firegl_agpgart_inuse' is initialized
/var/tmp/portage/x11-drivers/ati-drivers-8.32.5/work/common/lib/modules/fglrx/build_mod/firegl_public.c:3475: erreur: storage class specified for parameter 'drm_agp_t'
/var/tmp/portage/x11-drivers/ati-drivers-8.32.5/work/common/lib/modules/fglrx/build_mod/firegl_public.c:3486: erreur: storage class specified for parameter 'firegl_agp_bridge'
/var/tmp/portage/x11-drivers/ati-drivers-8.32.5/work/common/lib/modules/fglrx/build_mod/firegl_public.c:3486: erreur: parameter 'firegl_agp_bridge' is initialized
/var/tmp/portage/x11-drivers/ati-drivers-8.32.5/work/common/lib/modules/fglrx/build_mod/firegl_public.c:3487: erreur: storage class specified for parameter 'firegl_pci_device'
/var/tmp/portage/x11-drivers/ati-drivers-8.32.5/work/common/lib/modules/fglrx/build_mod/firegl_public.c:3487: erreur: parameter 'firegl_pci_device' is initialized
/var/tmp/portage/x11-drivers/ati-drivers-8.32.5/work/common/lib/modules/fglrx/build_mod/firegl_public.c:3491: erreur: expected '=', ',', ';', 'asm' or '__attribute__' before '{' token
/var/tmp/portage/x11-drivers/ati-drivers-8.32.5/work/common/lib/modules/fglrx/build_mod/firegl_public.c:3496: erreur: expected '=', ',', ';', 'asm' or '__attribute__' before '{' token
/var/tmp/portage/x11-drivers/ati-drivers-8.32.5/work/common/lib/modules/fglrx/build_mod/firegl_public.c:3501: erreur: expected '=', ',', ';', 'asm' or '__attribute__' before '{' token
/var/tmp/portage/x11-drivers/ati-drivers-8.32.5/work/common/lib/modules/fglrx/build_mod/firegl_public.c:3507: erreur: expected '=', ',', ';', 'asm' or '__attribute__' before '{' token
/var/tmp/portage/x11-drivers/ati-drivers-8.32.5/work/common/lib/modules/fglrx/build_mod/firegl_public.c:3513: erreur: expected '=', ',', ';', 'asm' or '__attribute__' before '{' token
/var/tmp/portage/x11-drivers/ati-drivers-8.32.5/work/common/lib/modules/fglrx/build_mod/firegl_public.c:3518: erreur: expected '=', ',', ';', 'asm' or '__attribute__' before 'drm_agp'
/var/tmp/portage/x11-drivers/ati-drivers-8.32.5/work/common/lib/modules/fglrx/build_mod/firegl_public.c:3527: erreur: expected declaration specifiers before ';' token
/var/tmp/portage/x11-drivers/ati-drivers-8.32.5/work/common/lib/modules/fglrx/build_mod/firegl_public.c:3568: erreur: expected '=', ',', ';', 'asm' or '__attribute__' before '*' token
/var/tmp/portage/x11-drivers/ati-drivers-8.32.5/work/common/lib/modules/fglrx/build_mod/firegl_public.c:3677: erreur: expected '=', ',', ';', 'asm' or '__attribute__' before '{' token
/var/tmp/portage/x11-drivers/ati-drivers-8.32.5/work/common/lib/modules/fglrx/build_mod/firegl_public.c:3703: erreur: expected '=', ',', ';', 'asm' or '__attribute__' before '{' token
/var/tmp/portage/x11-drivers/ati-drivers-8.32.5/work/common/lib/modules/fglrx/build_mod/firegl_public.c:3711: erreur: expected '=', ',', ';', 'asm' or '__attribute__' before '{' token
/var/tmp/portage/x11-drivers/ati-drivers-8.32.5/work/common/lib/modules/fglrx/build_mod/firegl_public.c:3736: erreur: expected '=', ',', ';', 'asm' or '__attribute__' before '{' token
/var/tmp/portage/x11-drivers/ati-drivers-8.32.5/work/common/lib/modules/fglrx/build_mod/firegl_public.c:3750: erreur: expected '=', ',', ';', 'asm' or '__attribute__' before '{' token
/var/tmp/portage/x11-drivers/ati-drivers-8.32.5/work/common/lib/modules/fglrx/build_mod/firegl_public.c:3756: erreur: expected '=', ',', ';', 'asm' or '__attribute__' before '{' token
/var/tmp/portage/x11-drivers/ati-drivers-8.32.5/work/common/lib/modules/fglrx/build_mod/firegl_public.c:3764: erreur: expected '=', ',', ';', 'asm' or '__attribute__' before '{' token
/var/tmp/portage/x11-drivers/ati-drivers-8.32.5/work/common/lib/modules/fglrx/build_mod/firegl_public.c:3772: erreur: expected '=', ',', ';', 'asm' or '__attribute__' before '{' token
/var/tmp/portage/x11-drivers/ati-drivers-8.32.5/work/common/lib/modules/fglrx/build_mod/firegl_public.c:3780: erreur: expected '=', ',', ';', 'asm' or '__attribute__' before '{' token
/var/tmp/portage/x11-drivers/ati-drivers-8.32.5/work/common/lib/modules/fglrx/build_mod/firegl_public.c:3789: erreur: expected '=', ',', ';', 'asm' or '__attribute__' before '{' token
/var/tmp/portage/x11-drivers/ati-drivers-8.32.5/work/common/lib/modules/fglrx/build_mod/firegl_public.c:3820: erreur: expected '=', ',', ';', 'asm' or '__attribute__' before '{' token
/var/tmp/portage/x11-drivers/ati-drivers-8.32.5/work/common/lib/modules/fglrx/build_mod/firegl_public.c:3831: erreur: expected '=', ',', ';', 'asm' or '__attribute__' before '{' token
/var/tmp/portage/x11-drivers/ati-drivers-8.32.5/work/common/lib/modules/fglrx/build_mod/firegl_public.c:3837: erreur: expected '=', ',', ';', 'asm' or '__attribute__' before '{' token
/var/tmp/portage/x11-drivers/ati-drivers-8.32.5/work/common/lib/modules/fglrx/build_mod/firegl_public.c:3903: erreur: expected '=', ',', ';', 'asm' or '__attribute__' before '{' token
/var/tmp/portage/x11-drivers/ati-drivers-8.32.5/work/common/lib/modules/fglrx/build_mod/firegl_public.c:3909: erreur: expected '=', ',', ';', 'asm' or '__attribute__' before '{' token
/var/tmp/portage/x11-drivers/ati-drivers-8.32.5/work/common/lib/modules/fglrx/build_mod/firegl_public.c:3980: erreur: expected '=', ',', ';', 'asm' or '__attribute__' before '{' token
/var/tmp/portage/x11-drivers/ati-drivers-8.32.5/work/common/lib/modules/fglrx/build_mod/firegl_public.c:3996: erreur: expected '=', ',', ';', 'asm' or '__attribute__' before '{' token
/var/tmp/portage/x11-drivers/ati-drivers-8.32.5/work/common/lib/modules/fglrx/build_mod/firegl_public.c:4002: erreur: expected '=', ',', ';', 'asm' or '__attribute__' before '{' token
/var/tmp/portage/x11-drivers/ati-drivers-8.32.5/work/common/lib/modules/fglrx/build_mod/firegl_public.c:4006: erreur: déclaration de paramètre d'ancien style dans la définition prototypée de fonction
/var/tmp/portage/x11-drivers/ati-drivers-8.32.5/work/common/lib/modules/fglrx/build_mod/firegl_public.c:185: erreur: nom de paramètre omis
/var/tmp/portage/x11-drivers/ati-drivers-8.32.5/work/common/lib/modules/fglrx/build_mod/firegl_public.c:185: erreur: nom de paramètre omis
/var/tmp/portage/x11-drivers/ati-drivers-8.32.5/work/common/lib/modules/fglrx/build_mod/firegl_public.c:185: erreur: nom de paramètre omis
/var/tmp/portage/x11-drivers/ati-drivers-8.32.5/work/common/lib/modules/fglrx/build_mod/firegl_public.c:4006: erreur: expected '{' at end of input
make[2]: *** [/var/tmp/portage/x11-drivers/ati-drivers-8.32.5/work/common/lib/modules/fglrx/build_mod/firegl_public.o] Erreur 1
make[1]: *** [_module_/var/tmp/portage/x11-drivers/ati-drivers-8.32.5/work/common/lib/modules/fglrx/build_mod] Erreur 2
make[1]: quittant le répertoire « /usr/src/linux-2.6.20-gentoo-r7 »
make: *** [kmod_build] Erreur 2

!!! ERROR: x11-drivers/ati-drivers-8.32.5 failed.
Call stack:
  ebuild.sh, line 1614:   Called dyn_compile
  ebuild.sh, line 971:   Called qa_call 'src_compile'
  environment, line 4159:   Called src_compile
  ati-drivers-8.32.5.ebuild, line 157:   Called linux-mod_src_compile
  linux-mod.eclass, line 516:   Called die

!!! Unable to make  GCC_VER_MAJ=4 KVER=2.6.20-gentoo-r7 KDIR=/usr/src/linux kmod_build.
!!! If you need support, post the topmost build error, and the call stack if relevant.
!!! A complete build log is located at '/var/tmp/portage/x11-drivers/ati-drivers-8.32.5/temp/build.log'.