rendered paste body0.1+svnnow-r0_1468: task do_compile: comple
ted
NOTE: package openmoko-panel-clock-0.0.1+svnnow-r0_1468: task do_install: starte
d
NOTE: package openmoko-panel-clock-0.0.1+svnnow-r0_1468: task do_install: comple
ted
NOTE: package openmoko-panel-clock-0.0.1+svnnow-r0_1468: task do_package: starte
d
NOTE: the following files were installed but not shipped in any package:
NOTE: /usr/lib/matchbox-panel/libopenmoko-panel-clock.a
NOTE: /usr/lib/matchbox-panel/libopenmoko-panel-clock.la
NOTE: package openmoko-panel-clock-0.0.1+svnnow-r0_1468: task do_package: comple
ted
NOTE: package openmoko-panel-clock-0.0.1+svnnow-r0_1468: task do_package_write:
started
Packaged contents of openmoko-panel-clock-dbg into /home/moko/build/tmp/deploy/i
pk/i486/openmoko-panel-clock-dbg_0.0.1+svnnow-r0_1468_i486.ipk
Packaged contents of openmoko-panel-clock into /home/moko/build/tmp/deploy/ipk/i
486/openmoko-panel-clock_0.0.1+svnnow-r0_1468_i486.ipk
NOTE: Not creating empty archive for openmoko-panel-clock-doc-0.0.1+svnnow-r0_14
68
NOTE: Not creating empty archive for openmoko-panel-clock-dev-0.0.1+svnnow-r0_14
68
NOTE: Not creating empty archive for openmoko-panel-clock-locale-0.0.1+svnnow-r0
_1468
NOTE: package openmoko-panel-clock-0.0.1+svnnow-r0_1468: task do_package_write:
completed
NOTE: package openmoko-panel-clock-0.0.1+svnnow-r0_1468: task do_populate_stagin
g: started
NOTE: package openmoko-panel-clock-0.0.1+svnnow-r0_1468: task do_populate_stagin
g: completed
NOTE: package openmoko-panel-clock-0.0.1+svnnow-r0_1468: task do_build: started
NOTE: package openmoko-panel-clock-0.0.1+svnnow-r0_1468: task do_build: complete
d
NOTE: package openmoko-panel-clock-0.0.1+svnnow: completed
NOTE: Retrieved remote revisions: ['1468']
NOTE: package openmoko-panel-gps-0.0.1+svnnow: started
NOTE: package openmoko-panel-gps-0.0.1+svnnow-r0_1468: task do_fetch: started
NOTE: fetch http://downloads.openmoko.org/sources/openmoko-panel-gps_svn.openmok
o.org_.trunk.src.target.OM-2007.panel-plugins_1468_.tar.gz
--23:08:03-- http://downloads.openmoko.org/sources/openmoko-panel-gps_svn.openm
oko.org_.trunk.src.target.OM-2007.panel-plugins_1468_.tar.gz
=> `/home/moko/sources/openmoko-panel-gps_svn.openmoko.org_.trunk.src
.target.OM-2007.panel-plugins_1468_.tar.gz'
Resolving downloads.openmoko.org... 88.198.93.219
Connecting to downloads.openmoko.org[88.198.93.219]:80... connected.
HTTP request sent, awaiting response... 200 OK
Length: 22,971 [application/x-tar]
100%[====================================>] 22,971 35.78K/s
23:08:04 (35.68 KB/s) - `/home/moko/sources/openmoko-panel-gps_svn.openmoko.org_
.trunk.src.target.OM-2007.panel-plugins_1468_.tar.gz' saved [22,971/22,971]
NOTE: Fetched openmoko-panel-gps_svn.openmoko.org_.trunk.src.target.OM-2007.pane
l-plugins_1468_.tar.gz from tarball stash, skipping checkout
NOTE: package openmoko-panel-gps-0.0.1+svnnow-r0_1468: task do_fetch: completed
NOTE: package openmoko-panel-gps-0.0.1+svnnow-r0_1468: task do_unpack: started
NOTE: Unpacking /home/moko/sources/openmoko-panel-gps_svn.openmoko.org_.trunk.sr
c.target.OM-2007.panel-plugins_1468_.tar.gz to /home/moko/build/tmp/work/i486-li
nux/openmoko-panel-gps-0.0.1+svnnow-r0_1468/
NOTE: package openmoko-panel-gps-0.0.1+svnnow-r0_1468: task do_unpack: completed
NOTE: package openmoko-panel-gps-0.0.1+svnnow-r0_1468: task do_patch: started
NOTE: package openmoko-panel-gps-0.0.1+svnnow-r0_1468: task do_patch: completed
NOTE: package openmoko-panel-gps-0.0.1+svnnow-r0_1468: task do_configure: starte
d
NOTE: package openmoko-panel-gps-0.0.1+svnnow-r0_1468: task do_configure: comple
ted
NOTE: package openmoko-panel-gps-0.0.1+svnnow-r0_1468: task do_compile: started
NOTE: package openmoko-panel-gps-0.0.1+svnnow-r0_1468: task do_compile: complete
d
NOTE: package openmoko-panel-gps-0.0.1+svnnow-r0_1468: task do_install: started
NOTE: package openmoko-panel-gps-0.0.1+svnnow-r0_1468: task do_install: complete
d
NOTE: package openmoko-panel-gps-0.0.1+svnnow-r0_1468: task do_package: started
NOTE: the following files were installed but not shipped in any package:
NOTE: /usr/lib/matchbox-panel/libopenmoko-panel-gps.la
NOTE: /usr/lib/matchbox-panel/libopenmoko-panel-gps.a
NOTE: package openmoko-panel-gps-0.0.1+svnnow-r0_1468: task do_package: complete
d
NOTE: package openmoko-panel-gps-0.0.1+svnnow-r0_1468: task do_package_write: st
arted
Packaged contents of openmoko-panel-gps-dbg into /home/moko/build/tmp/deploy/ipk
/i486/openmoko-panel-gps-dbg_0.0.1+svnnow-r0_1468_i486.ipk
Packaged contents of openmoko-panel-gps into /home/moko/build/tmp/deploy/ipk/i48
6/openmoko-panel-gps_0.0.1+svnnow-r0_1468_i486.ipk
NOTE: Not creating empty archive for openmoko-panel-gps-doc-0.0.1+svnnow-r0_1468
NOTE: Not creating empty archive for openmoko-panel-gps-dev-0.0.1+svnnow-r0_1468
NOTE: Not creating empty archive for openmoko-panel-gps-locale-0.0.1+svnnow-r0_1
468
NOTE: package openmoko-panel-gps-0.0.1+svnnow-r0_1468: task do_package_write: co
mpleted
NOTE: package openmoko-panel-gps-0.0.1+svnnow-r0_1468: task do_populate_staging:
started
NOTE: package openmoko-panel-gps-0.0.1+svnnow-r0_1468: task do_populate_staging:
completed
NOTE: package openmoko-panel-gps-0.0.1+svnnow-r0_1468: task do_build: started
NOTE: package openmoko-panel-gps-0.0.1+svnnow-r0_1468: task do_build: completed
NOTE: package openmoko-panel-gps-0.0.1+svnnow: completed
NOTE: Retrieved remote revisions: ['1587']
NOTE: package openmoko-panel-battery-0.0.1+svnnow: started
NOTE: package openmoko-panel-battery-0.0.1+svnnow-r0_1587: task do_fetch: starte
d
NOTE: fetch http://downloads.openmoko.org/sources/openmoko-panel-battery_svn.ope
nmoko.org_.trunk.src.target.OM-2007.panel-plugins_1587_.tar.gz
--23:08:43-- http://downloads.openmoko.org/sources/openmoko-panel-battery_svn.o
penmoko.org_.trunk.src.target.OM-2007.panel-plugins_1587_.tar.gz
=> `/home/moko/sources/openmoko-panel-battery_svn.openmoko.org_.trunk
.src.target.OM-2007.panel-plugins_1587_.tar.gz'
Resolving downloads.openmoko.org... 88.198.93.219
Connecting to downloads.openmoko.org[88.198.93.219]:80... connected.
HTTP request sent, awaiting response... 200 OK
Length: 26,992 [application/x-tar]
100%[====================================>] 26,992 39.31K/s
23:08:45 (39.27 KB/s) - `/home/moko/sources/openmoko-panel-battery_svn.openmoko.
org_.trunk.src.target.OM-2007.panel-plugins_1587_.tar.gz' saved [26,992/26,992]
NOTE: Fetched openmoko-panel-battery_svn.openmoko.org_.trunk.src.target.OM-2007.
panel-plugins_1587_.tar.gz from tarball stash, skipping checkout
NOTE: package openmoko-panel-battery-0.0.1+svnnow-r0_1587: task do_fetch: comple
ted
NOTE: package openmoko-panel-battery-0.0.1+svnnow-r0_1587: task do_unpack: start
ed
NOTE: Unpacking /home/moko/sources/openmoko-panel-battery_svn.openmoko.org_.trun
k.src.target.OM-2007.panel-plugins_1587_.tar.gz to /home/moko/build/tmp/work/i48
6-linux/openmoko-panel-battery-0.0.1+svnnow-r0_1587/
NOTE: package openmoko-panel-battery-0.0.1+svnnow-r0_1587: task do_unpack: compl
eted
NOTE: package openmoko-panel-battery-0.0.1+svnnow-r0_1587: task do_patch: starte
d
NOTE: package openmoko-panel-battery-0.0.1+svnnow-r0_1587: task do_patch: comple
ted
NOTE: package openmoko-panel-battery-0.0.1+svnnow-r0_1587: task do_configure: st
arted
NOTE: package openmoko-panel-battery-0.0.1+svnnow-r0_1587: task do_configure: co
mpleted
NOTE: package openmoko-panel-battery-0.0.1+svnnow-r0_1587: task do_compile: star
ted
ERROR: function do_compile failed
ERROR: log data follows (/home/moko/build/tmp/work/i486-linux/openmoko-panel-bat
tery-0.0.1+svnnow-r0_1587/temp/log.do_compile.19478)
| NOTE: make
| make[1]: Entering directory `/home/moko/build/tmp/work/i486-linux/openmoko-pan
el-battery-0.0.1+svnnow-r0_1587/openmoko-panel-battery'
| make all-recursive
| make[2]: Entering directory `/home/moko/build/tmp/work/i486-linux/openmoko-pan
el-battery-0.0.1+svnnow-r0_1587/openmoko-panel-battery'
| Making all in src
| make[3]: Entering directory `/home/moko/build/tmp/work/i486-linux/openmoko-pan
el-battery-0.0.1+svnnow-r0_1587/openmoko-panel-battery/src'
| if /bin/sh ../i486-linux-libtool --tag=CC --mode=compile ccache i486-linux-gcc
-DHAVE_CONFIG_H -I. -I/home/moko/build/tmp/work/i486-linux/openmoko-panel-batte
ry-0.0.1+svnnow-r0_1587/openmoko-panel-battery/src -I.. -DPKGDATADIR=\"/usr/sha
re/openmoko-panel-battery\" -DGETTEXT_PACKAGE=\"matchbox-panel\" -isystem/home/m
oko/build/tmp/staging/i486-linux/include -Wall -std=c99 -pedantic -I/home/moko/b
uild/tmp/staging/i486-linux/lib/../include/openmoko-libs -I/home/moko/build/tmp/
staging/i486-linux/include/gtk-2.0 -I/home/moko/build/tmp/staging/i486-linux/lib
/gtk-2.0/include -I/home/moko/build/tmp/staging/i486-linux/include -I/home/moko/
build/tmp/staging/i486-linux/include/atk-1.0 -I/home/moko/build/tmp/staging/i486
-linux/include/pango-1.0 -I/home/moko/build/tmp/staging/i486-linux/include/freet
ype2 -I/usr/X11R6/include -I/home/moko/build/tmp/staging/i486-linux/include/glib
-2.0 -I/home/moko/build/tmp/staging/i486-linux/lib/glib-2.0/include -isystem/h
ome/moko/build/tmp/staging/i486-linux/include -O -g -I/home/moko/build/tmp/stagi
ng/i486-linux/lib/../include/openmoko-libs -I/home/moko/build/tmp/staging/i486-l
inux/include/gtk-2.0 -I/home/moko/build/tmp/staging/i486-linux/lib/gtk-2.0/inclu
de -I/home/moko/build/tmp/staging/i486-linux/include -I/home/moko/build/tmp/stag
ing/i486-linux/include/atk-1.0 -I/home/moko/build/tmp/staging/i486-linux/include
/pango-1.0 -I/home/moko/build/tmp/staging/i486-linux/include/freetype2 -I/usr/X1
1R6/include -I/home/moko/build/tmp/staging/i486-linux/include/glib-2.0 -I/home/m
oko/build/tmp/staging/i486-linux/lib/glib-2.0/include -MT openmoko-panel-batte
ry.lo -MD -MP -MF ".deps/openmoko-panel-battery.Tpo" -c -o openmoko-panel-batter
y.lo openmoko-panel-battery.c; \
| then mv -f ".deps/openmoko-panel-battery.Tpo" ".deps/openmoko-panel-batt
ery.Plo"; else rm -f ".deps/openmoko-panel-battery.Tpo"; exit 1; fi
| mkdir .libs
| ccache i486-linux-gcc -DHAVE_CONFIG_H -I. -I/home/moko/build/tmp/work/i486-li
nux/openmoko-panel-battery-0.0.1+svnnow-r0_1587/openmoko-panel-battery/src -I..
-DPKGDATADIR=\"/usr/share/openmoko-panel-battery\" -DGETTEXT_PACKAGE=\"matchbox-
panel\" -isystem/home/moko/build/tmp/staging/i486-linux/include -Wall -std=c99 -
pedantic -I/home/moko/build/tmp/staging/i486-linux/lib/../include/openmoko-libs
-I/home/moko/build/tmp/staging/i486-linux/include/gtk-2.0 -I/home/moko/build/tmp
/staging/i486-linux/lib/gtk-2.0/include -I/home/moko/build/tmp/staging/i486-linu
x/include -I/home/moko/build/tmp/staging/i486-linux/include/atk-1.0 -I/home/moko
/build/tmp/staging/i486-linux/include/pango-1.0 -I/home/moko/build/tmp/staging/i
486-linux/include/freetype2 -I/usr/X11R6/include -I/home/moko/build/tmp/staging/
i486-linux/include/glib-2.0 -I/home/moko/build/tmp/staging/i486-linux/lib/glib-2
.0/include -isystem/home/moko/build/tmp/staging/i486-linux/include -O -g -I/home
/moko/build/tmp/staging/i486-linux/lib/../include/openmoko-libs -I/home/moko/bui
ld/tmp/staging/i486-linux/include/gtk-2.0 -I/home/moko/build/tmp/staging/i486-li
nux/lib/gtk-2.0/include -I/home/moko/build/tmp/staging/i486-linux/include -I/hom
e/moko/build/tmp/staging/i486-linux/include/atk-1.0 -I/home/moko/build/tmp/stagi
ng/i486-linux/include/pango-1.0 -I/home/moko/build/tmp/staging/i486-linux/includ
e/freetype2 -I/usr/X11R6/include -I/home/moko/build/tmp/staging/i486-linux/inclu
de/glib-2.0 -I/home/moko/build/tmp/staging/i486-linux/lib/glib-2.0/include -MT o
penmoko-panel-battery.lo -MD -MP -MF .deps/openmoko-panel-battery.Tpo -c openmok
o-panel-battery.c -fPIC -DPIC -o .libs/openmoko-panel-battery.o
| openmoko-panel-battery.c:26:17: error: apm.h: No such file or directory
| openmoko-panel-battery.c: In function 'timeout':
| openmoko-panel-battery.c:56: error: 'apm_info' undeclared (first use in this f
unction)
| openmoko-panel-battery.c:56: error: (Each undeclared identifier is reported on
ly once
| openmoko-panel-battery.c:56: error: for each function it appears in.)
| openmoko-panel-battery.c:56: error: expected ';' before 'info'
| openmoko-panel-battery.c:58: error: 'info' undeclared (first use in this funct
ion)
| openmoko-panel-battery.c:59: warning: implicit declaration of function 'apm_re
ad'
| openmoko-panel-battery.c:75: error: 'BATTERY_STATUS_ABSENT' undeclared (first
use in this function)
| openmoko-panel-battery.c:76: error: 'BATTERY_STATUS_CHARGING' undeclared (first use in this function)
| openmoko-panel-battery.c: At top level:
| openmoko-panel-battery.c:149: warning: ISO C does not allow extra ';' outsideof a function
| make[3]: *** [openmoko-panel-battery.lo] Error 1
| make[3]: Leaving directory `/home/moko/build/tmp/work/i486-linux/openmoko-panel-battery-0.0.1+svnnow-r0_1587/openmoko-panel-battery/src'
| make[2]: *** [all-recursive] Error 1
| make[2]: Leaving directory `/home/moko/build/tmp/work/i486-linux/openmoko-panel-battery-0.0.1+svnnow-r0_1587/openmoko-panel-battery'
| make[1]: *** [all] Error 2
| make[1]: Leaving directory `/home/moko/build/tmp/work/i486-linux/openmoko-panel-battery-0.0.1+svnnow-r0_1587/openmoko-panel-battery'
| FATAL: oe_runmake failed
NOTE: Task failed: /home/moko/build/tmp/work/i486-linux/openmoko-panel-battery-0.0.1+svnnow-r0_1587/temp/log.do_compile.19478
NOTE: package openmoko-panel-battery-0.0.1+svnnow-r0_1587: task do_compile: failed
ERROR: TaskFailed event exception, aborting
NOTE: package openmoko-panel-battery-0.0.1+svnnow: failed
ERROR: Build of openmoko-devel-image failed
make: *** [openmoko-devel-image] Error 1
[root@localhost moko]#