LD [M] /usr/src/zaptel-1.4.2.1/wct4xxp/wct4xxp.o
CC [M] /usr/src/zaptel-1.4.2.1/wctc4xxp/base.o
LD [M] /usr/src/zaptel-1.4.2.1/wctc4xxp/wctc4xxp.o
Compile xpp (version trunk-r3495)
CC [M] /usr/src/zaptel-1.4.2.1/xpp/card_fxo.o
CC [M] /usr/src/zaptel-1.4.2.1/xpp/card_fxs.o
CC [M] /usr/src/zaptel-1.4.2.1/xpp/xbus-core.o
/usr/src/zaptel-1.4.2.1/xpp/xbus-core.c: In function debugfs_open:
/usr/src/zaptel-1.4.2.1/xpp/xbus-core.c:171: error: struct inode has no member named u
/usr/src/zaptel-1.4.2.1/xpp/xbus-core.c: In function proc_xbus_command_write:
/usr/src/zaptel-1.4.2.1/xpp/xbus-core.c:1108: warning: format %d expects type int, but argument 6 has type long int
/usr/src/zaptel-1.4.2.1/xpp/xbus-core.c:1118: warning: format %d expects type int, but argument 6 has type long int
make[4]: *** [/usr/src/zaptel-1.4.2.1/xpp/xbus-core.o] Error 1
make[3]: *** [/usr/src/zaptel-1.4.2.1/xpp] Error 2
make[2]: *** [_module_/usr/src/zaptel-1.4.2.1] Error 2
make[2]: Leaving directory `/usr/src/kernels/2.6.18-8.1.1.el5-x86_64'
make[1]: *** [modules] Error 2
make[1]: Leaving directory `/usr/src/zaptel-1.4.2.1'
make: *** [all] Error 2
[root@localhost zaptel-1.4.2.1]#