All pastes #46063 Raw Edit

PyLucene on Dapper D

public text v1 · immutable
#46063 ·published 2006-03-17 21:37 UTC
rendered paste body
mkdir -p release/classes
/usr/bin/gcc -shared -o release/libdb_java-4.4.so -O2 -fPIC  -I/usr/include -I/home/rae/work/osaf/chandler/external/release/db/include -I/home/rae/work/osaf/chandler/external/db/db-4.4.20 -I/home/rae/work/osaf/chandler/external/db/db-4.4.20/build_release /home/rae/work/osaf/chandler/external/db/db-4.4.20/libdb_java/db_java_wrap.c /home/rae/work/osaf/chandler/external/release/db/lib/libdb-4.4.so
/home/rae/work/osaf/chandler/external/db/db-4.4.20/libdb_java/db_java_wrap.c:91:17: error: jni.h: No such file or directory
/home/rae/work/osaf/chandler/external/db/db-4.4.20/libdb_java/db_java_wrap.c:115: error: syntax error before ‘*’ token
/home/rae/work/osaf/chandler/external/db/db-4.4.20/libdb_java/db_java_wrap.c: In function ‘SWIG_JavaThrowException’:
/home/rae/work/osaf/chandler/external/db/db-4.4.20/libdb_java/db_java_wrap.c:116: error: ‘jclass’ undeclared (first use in this function)
/home/rae/work/osaf/chandler/external/db/db-4.4.20/libdb_java/db_java_wrap.c:116: error: (Each undeclared identifier is reported only once
/home/rae/work/osaf/chandler/external/db/db-4.4.20/libdb_java/db_java_wrap.c:116: error: for each function it appears in.)
/home/rae/work/osaf/chandler/external/db/db-4.4.20/libdb_java/db_java_wrap.c:116: error: syntax error before ‘excep’
/home/rae/work/osaf/chandler/external/db/db-4.4.20/libdb_java/db_java_wrap.c:130: error: ‘code’ undeclared (first use in this function)
/home/rae/work/osaf/chandler/external/db/db-4.4.20/libdb_java/db_java_wrap.c:133: error: ‘jenv’ undeclared (first use in this function)
/home/rae/work/osaf/chandler/external/db/db-4.4.20/libdb_java/db_java_wrap.c:134: error: ‘excep’ undeclared (first use in this function)
/home/rae/work/osaf/chandler/external/db/db-4.4.20/libdb_java/db_java_wrap.c:136: error: ‘msg’ undeclared (first use in this function)
/home/rae/work/osaf/chandler/external/db/db-4.4.20/libdb_java/db_java_wrap.c: At top level:
/home/rae/work/osaf/chandler/external/db/db-4.4.20/libdb_java/db_java_wrap.c:164: error: syntax error before ‘*’ token
/home/rae/work/osaf/chandler/external/db/db-4.4.20/libdb_java/db_java_wrap.c:168: error: syntax error before ‘*’ token
/home/rae/work/osaf/chandler/external/db/db-4.4.20/libdb_java/db_java_wrap.c:168: warning: data definition has no type or storage class
/home/rae/work/osaf/chandler/external/db/db-4.4.20/libdb_java/db_java_wrap.c:170: error: syntax error before ‘db_class’
/home/rae/work/osaf/chandler/external/db/db-4.4.20/libdb_java/db_java_wrap.c:170: warning: data definition has no type or storage class
/home/rae/work/osaf/chandler/external/db/db-4.4.20/libdb_java/db_java_wrap.c:171: error: syntax error before ‘dbpreplist_class’
/home/rae/work/osaf/chandler/external/db/db-4.4.20/libdb_java/db_java_wrap.c:171: warning: data definition has no type or storage class
/home/rae/work/osaf/chandler/external/db/db-4.4.20/libdb_java/db_java_wrap.c:172: error: syntax error before ‘keyrange_class’
/home/rae/work/osaf/chandler/external/db/db-4.4.20/libdb_java/db_java_wrap.c:172: warning: data definition has no type or storage class
/home/rae/work/osaf/chandler/external/db/db-4.4.20/libdb_java/db_java_wrap.c:173: error: syntax error before ‘bt_stat_class’
/home/rae/work/osaf/chandler/external/db/db-4.4.20/libdb_java/db_java_wrap.c:173: warning: data definition has no type or storage class
/home/rae/work/osaf/chandler/external/db/db-4.4.20/libdb_java/db_java_wrap.c:174: error: syntax error before ‘log_stat_class’
/home/rae/work/osaf/chandler/external/db/db-4.4.20/libdb_java/db_java_wrap.c:174: warning: data definition has no type or storage class
/home/rae/work/osaf/chandler/external/db/db-4.4.20/libdb_java/db_java_wrap.c:175: error: syntax error before ‘mutex_stat_class’
/home/rae/work/osaf/chandler/external/db/db-4.4.20/libdb_java/db_java_wrap.c:175: warning: data definition has no type or storage class
/home/rae/work/osaf/chandler/external/db/db-4.4.20/libdb_java/db_java_wrap.c:176: error: syntax error before ‘seq_stat_class’
/home/rae/work/osaf/chandler/external/db/db-4.4.20/libdb_java/db_java_wrap.c:176: warning: data definition has no type or storage class
/home/rae/work/osaf/chandler/external/db/db-4.4.20/libdb_java/db_java_wrap.c:177: error: syntax error before ‘txn_active_class’
/home/rae/work/osaf/chandler/external/db/db-4.4.20/libdb_java/db_java_wrap.c:177: warning: data definition has no type or storage class
/home/rae/work/osaf/chandler/external/db/db-4.4.20/libdb_java/db_java_wrap.c:178: error: syntax error before ‘lock_class’
/home/rae/work/osaf/chandler/external/db/db-4.4.20/libdb_java/db_java_wrap.c:178: warning: data definition has no type or storage class
/home/rae/work/osaf/chandler/external/db/db-4.4.20/libdb_java/db_java_wrap.c:179: error: syntax error before ‘dbex_class’
/home/rae/work/osaf/chandler/external/db/db-4.4.20/libdb_java/db_java_wrap.c:179: warning: data definition has no type or storage class
/home/rae/work/osaf/chandler/external/db/db-4.4.20/libdb_java/db_java_wrap.c:180: error: syntax error before ‘repdupmasterex_class’
/home/rae/work/osaf/chandler/external/db/db-4.4.20/libdb_java/db_java_wrap.c:180: warning: data definition has no type or storage class
/home/rae/work/osaf/chandler/external/db/db-4.4.20/libdb_java/db_java_wrap.c:181: error: syntax error before ‘repholdelectionex_class’
/home/rae/work/osaf/chandler/external/db/db-4.4.20/libdb_java/db_java_wrap.c:181: warning: data definition has no type or storage class
/home/rae/work/osaf/chandler/external/db/db-4.4.20/libdb_java/db_java_wrap.c:182: error: syntax error before ‘repunavailex_class’
/home/rae/work/osaf/chandler/external/db/db-4.4.20/libdb_java/db_java_wrap.c:182: warning: data definition has no type or storage class
/home/rae/work/osaf/chandler/external/db/db-4.4.20/libdb_java/db_java_wrap.c:183: error: syntax error before ‘runrecex_class’
/home/rae/work/osaf/chandler/external/db/db-4.4.20/libdb_java/db_java_wrap.c:183: warning: data definition has no type or storage class
/home/rae/work/osaf/chandler/external/db/db-4.4.20/libdb_java/db_java_wrap.c:184: error: syntax error before ‘filenotfoundex_class’
/home/rae/work/osaf/chandler/external/db/db-4.4.20/libdb_java/db_java_wrap.c:184: warning: data definition has no type or storage class
/home/rae/work/osaf/chandler/external/db/db-4.4.20/libdb_java/db_java_wrap.c:185: error: syntax error before ‘bytearray_class’
/home/rae/work/osaf/chandler/external/db/db-4.4.20/libdb_java/db_java_wrap.c:185: warning: data definition has no type or storage class
/home/rae/work/osaf/chandler/external/db/db-4.4.20/libdb_java/db_java_wrap.c:187: error: syntax error before ‘dbc_cptr_fid’
/home/rae/work/osaf/chandler/external/db/db-4.4.20/libdb_java/db_java_wrap.c:187: warning: data definition has no type or storage class
/home/rae/work/osaf/chandler/external/db/db-4.4.20/libdb_java/db_java_wrap.c:188: error: syntax error before ‘dblsn_file_fid’
/home/rae/work/osaf/chandler/external/db/db-4.4.20/libdb_java/db_java_wrap.c:188: warning: data definition has no type or storage class
/home/rae/work/osaf/chandler/external/db/db-4.4.20/libdb_java/db_java_wrap.c:189: error: syntax error before ‘dbt_data_fid’
/home/rae/work/osaf/chandler/external/db/db-4.4.20/libdb_java/db_java_wrap.c:189: warning: data definition has no type or storage class
/home/rae/work/osaf/chandler/external/db/db-4.4.20/libdb_java/db_java_wrap.c:190: error: syntax error before ‘dbt_doff_fid’
/home/rae/work/osaf/chandler/external/db/db-4.4.20/libdb_java/db_java_wrap.c:190: warning: data definition has no type or storage class
/home/rae/work/osaf/chandler/external/db/db-4.4.20/libdb_java/db_java_wrap.c:191: error: syntax error before ‘kr_less_fid’
/home/rae/work/osaf/chandler/external/db/db-4.4.20/libdb_java/db_java_wrap.c:191: warning: data definition has no type or storage class
/home/rae/work/osaf/chandler/external/db/db-4.4.20/libdb_java/db_java_wrap.c:192: error: syntax error before ‘lock_cptr_fid’
/home/rae/work/osaf/chandler/external/db/db-4.4.20/libdb_java/db_java_wrap.c:192: warning: data definition has no type or storage class
/home/rae/work/osaf/chandler/external/db/db-4.4.20/libdb_java/db_java_wrap.c:193: error: syntax error before ‘lockreq_op_fid’
/home/rae/work/osaf/chandler/external/db/db-4.4.20/libdb_java/db_java_wrap.c:193: warning: data definition has no type or storage class
/home/rae/work/osaf/chandler/external/db/db-4.4.20/libdb_java/db_java_wrap.c:194: error: syntax error before ‘lockreq_obj_fid’
/home/rae/work/osaf/chandler/external/db/db-4.4.20/libdb_java/db_java_wrap.c:194: warning: data definition has no type or storage class
/home/rae/work/osaf/chandler/external/db/db-4.4.20/libdb_java/db_java_wrap.c:195: error: syntax error before ‘rep_processmsg_envid’
/home/rae/work/osaf/chandler/external/db/db-4.4.20/libdb_java/db_java_wrap.c:195: warning: data definition has no type or storage class
/home/rae/work/osaf/chandler/external/db/db-4.4.20/libdb_java/db_java_wrap.c:198: error: syntax error before ‘bt_stat_bt_magic_fid’
/home/rae/work/osaf/chandler/external/db/db-4.4.20/libdb_java/db_java_wrap.c:198: warning: data definition has no type or storage class
/home/rae/work/osaf/chandler/external/db/db-4.4.20/libdb_java/db_java_wrap.c:199: error: syntax error before ‘bt_stat_bt_version_fid’
/home/rae/work/osaf/chandler/external/db/db-4.4.20/libdb_java/db_java_wrap.c:199: warning: data definition has no type or storage class
/home/rae/work/osaf/chandler/external/db/db-4.4.20/libdb_java/db_java_wrap.c:200: error: syntax error before ‘bt_stat_bt_metaflags_fid’
/home/rae/work/osaf/chandler/external/db/db-4.4.20/libdb_java/db_java_wrap.c:200: warning: data definition has no type or storage class
/home/rae/work/osaf/chandler/external/db/db-4.4.20/libdb_java/db_java_wrap.c:201: error: syntax error before ‘bt_stat_bt_nkeys_fid’
/home/rae/work/osaf/chandler/external/db/db-4.4.20/libdb_java/db_java_wrap.c:201: warning: data definition has no type or storage class
/home/rae/work/osaf/chandler/external/db/db-4.4.20/libdb_java/db_java_wrap.c:202: error: syntax error before ‘bt_stat_bt_ndata_fid’
/home/rae/work/osaf/chandler/external/db/db-4.4.20/libdb_java/db_java_wrap.c:202: warning: data definition has no type or storage class


[... many lines omitted ...]


/home/rae/work/osaf/chandler/external/db/db-4.4.20/libdb_java/db_java_wrap.c: At top level:
/home/rae/work/osaf/chandler/external/db/db-4.4.20/libdb_java/db_java_wrap.c:9196: error: syntax error before ‘jstring’
/home/rae/work/osaf/chandler/external/db/db-4.4.20/libdb_java/db_java_wrap.c:9196: error: syntax error before ‘*’ token
/home/rae/work/osaf/chandler/external/db/db-4.4.20/libdb_java/db_java_wrap.c: In function ‘Java_com_sleepycat_db_internal_db_1javaJNI_DbTxn_1get_1name’:
/home/rae/work/osaf/chandler/external/db/db-4.4.20/libdb_java/db_java_wrap.c:9197: error: ‘jstring’ undeclared (first use in this function)
/home/rae/work/osaf/chandler/external/db/db-4.4.20/libdb_java/db_java_wrap.c:9197: error: syntax error before ‘jresult’
/home/rae/work/osaf/chandler/external/db/db-4.4.20/libdb_java/db_java_wrap.c:9201: error: ‘jenv’ undeclared (first use in this function)
/home/rae/work/osaf/chandler/external/db/db-4.4.20/libdb_java/db_java_wrap.c:9202: error: ‘jcls’ undeclared (first use in this function)
/home/rae/work/osaf/chandler/external/db/db-4.4.20/libdb_java/db_java_wrap.c:9203: error: ‘jarg1’ undeclared (first use in this function)
/home/rae/work/osaf/chandler/external/db/db-4.4.20/libdb_java/db_java_wrap.c:9214: error: ‘jobject’ undeclared (first use in this function)
/home/rae/work/osaf/chandler/external/db/db-4.4.20/libdb_java/db_java_wrap.c:9218: error: ‘jresult’ undeclared (first use in this function)
/home/rae/work/osaf/chandler/external/db/db-4.4.20/libdb_java/db_java_wrap.c: At top level:
/home/rae/work/osaf/chandler/external/db/db-4.4.20/libdb_java/db_java_wrap.c:9224: error: syntax error before ‘jint’
/home/rae/work/osaf/chandler/external/db/db-4.4.20/libdb_java/db_java_wrap.c:9224: error: syntax error before ‘*’ token
/home/rae/work/osaf/chandler/external/db/db-4.4.20/libdb_java/db_java_wrap.c: In function ‘Java_com_sleepycat_db_internal_db_1javaJNI_DbTxn_1id’:
/home/rae/work/osaf/chandler/external/db/db-4.4.20/libdb_java/db_java_wrap.c:9225: error: ‘jint’ undeclared (first use in this function)
/home/rae/work/osaf/chandler/external/db/db-4.4.20/libdb_java/db_java_wrap.c:9225: error: syntax error before ‘jresult’
/home/rae/work/osaf/chandler/external/db/db-4.4.20/libdb_java/db_java_wrap.c:9229: error: ‘jenv’ undeclared (first use in this function)
/home/rae/work/osaf/chandler/external/db/db-4.4.20/libdb_java/db_java_wrap.c:9230: error: ‘jcls’ undeclared (first use in this function)
/home/rae/work/osaf/chandler/external/db/db-4.4.20/libdb_java/db_java_wrap.c:9231: error: ‘jarg1’ undeclared (first use in this function)
/home/rae/work/osaf/chandler/external/db/db-4.4.20/libdb_java/db_java_wrap.c:9239: error: ‘jresult’ undeclared (first use in this function)
/home/rae/work/osaf/chandler/external/db/db-4.4.20/libdb_java/db_java_wrap.c:9239: error: syntax error before ‘result’
/home/rae/work/osaf/chandler/external/db/db-4.4.20/libdb_java/db_java_wrap.c: At top level:
/home/rae/work/osaf/chandler/external/db/db-4.4.20/libdb_java/db_java_wrap.c:9244: error: syntax error before ‘void’
/home/rae/work/osaf/chandler/external/db/db-4.4.20/libdb_java/db_java_wrap.c:9244: error: syntax error before ‘*’ token
/home/rae/work/osaf/chandler/external/db/db-4.4.20/libdb_java/db_java_wrap.c: In function ‘Java_com_sleepycat_db_internal_db_1javaJNI_DbTxn_1prepare’:
/home/rae/work/osaf/chandler/external/db/db-4.4.20/libdb_java/db_java_wrap.c:9249: error: ‘jenv’ undeclared (first use in this function)
/home/rae/work/osaf/chandler/external/db/db-4.4.20/libdb_java/db_java_wrap.c:9250: error: ‘jcls’ undeclared (first use in this function)
/home/rae/work/osaf/chandler/external/db/db-4.4.20/libdb_java/db_java_wrap.c:9251: error: ‘jarg1’ undeclared (first use in this function)
/home/rae/work/osaf/chandler/external/db/db-4.4.20/libdb_java/db_java_wrap.c:9253: error: ‘jarg2’ undeclared (first use in this function)
/home/rae/work/osaf/chandler/external/db/db-4.4.20/libdb_java/db_java_wrap.c:9264: error: ‘jobject’ undeclared (first use in this function)
/home/rae/work/osaf/chandler/external/db/db-4.4.20/libdb_java/db_java_wrap.c:9276: error: ‘jbyte’ undeclared (first use in this function)
/home/rae/work/osaf/chandler/external/db/db-4.4.20/libdb_java/db_java_wrap.c:9276: error: syntax error before ‘)’ token
/home/rae/work/osaf/chandler/external/db/db-4.4.20/libdb_java/db_java_wrap.c: At top level:
/home/rae/work/osaf/chandler/external/db/db-4.4.20/libdb_java/db_java_wrap.c:9281: error: syntax error before ‘void’
/home/rae/work/osaf/chandler/external/db/db-4.4.20/libdb_java/db_java_wrap.c:9281: error: syntax error before ‘*’ token
/home/rae/work/osaf/chandler/external/db/db-4.4.20/libdb_java/db_java_wrap.c: In function ‘Java_com_sleepycat_db_internal_db_1javaJNI_DbTxn_1set_1timeout’:
/home/rae/work/osaf/chandler/external/db/db-4.4.20/libdb_java/db_java_wrap.c:9287: error: ‘jenv’ undeclared (first use in this function)
/home/rae/work/osaf/chandler/external/db/db-4.4.20/libdb_java/db_java_wrap.c:9288: error: ‘jcls’ undeclared (first use in this function)
/home/rae/work/osaf/chandler/external/db/db-4.4.20/libdb_java/db_java_wrap.c:9289: error: ‘jarg1’ undeclared (first use in this function)
/home/rae/work/osaf/chandler/external/db/db-4.4.20/libdb_java/db_java_wrap.c:9290: error: ‘jarg2’ undeclared (first use in this function)
/home/rae/work/osaf/chandler/external/db/db-4.4.20/libdb_java/db_java_wrap.c:9291: error: ‘jarg3’ undeclared (first use in this function)
/home/rae/work/osaf/chandler/external/db/db-4.4.20/libdb_java/db_java_wrap.c:9301: error: ‘jobject’ undeclared (first use in this function)
/home/rae/work/osaf/chandler/external/db/db-4.4.20/libdb_java/db_java_wrap.c: At top level:
/home/rae/work/osaf/chandler/external/db/db-4.4.20/libdb_java/db_java_wrap.c:9307: error: syntax error before ‘void’
/home/rae/work/osaf/chandler/external/db/db-4.4.20/libdb_java/db_java_wrap.c:9307: error: syntax error before ‘*’ token
/home/rae/work/osaf/chandler/external/db/db-4.4.20/libdb_java/db_java_wrap.c: In function ‘Java_com_sleepycat_db_internal_db_1javaJNI_DbTxn_1set_1name’:
/home/rae/work/osaf/chandler/external/db/db-4.4.20/libdb_java/db_java_wrap.c:9312: error: ‘jenv’ undeclared (first use in this function)
/home/rae/work/osaf/chandler/external/db/db-4.4.20/libdb_java/db_java_wrap.c:9313: error: ‘jcls’ undeclared (first use in this function)
/home/rae/work/osaf/chandler/external/db/db-4.4.20/libdb_java/db_java_wrap.c:9314: error: ‘jarg1’ undeclared (first use in this function)
/home/rae/work/osaf/chandler/external/db/db-4.4.20/libdb_java/db_java_wrap.c:9317: error: ‘jarg2’ undeclared (first use in this function)
/home/rae/work/osaf/chandler/external/db/db-4.4.20/libdb_java/db_java_wrap.c:9331: error: ‘jobject’ undeclared (first use in this function)
make[3]: *** [release/libdb_java-4.4.so] Error 1
make[3]: Leaving directory `/home/rae/work/osaf/chandler/external/PyLucene/PyLucene-src-1.9.1'
make[2]: *** [build] Error 2
make[2]: Leaving directory `/home/rae/work/osaf/chandler/external/PyLucene'
make[1]: *** [PyLucene] Error 2
make[1]: Leaving directory `/home/rae/work/osaf/chandler/external'
make: *** [to-PyLucene] Error 2