Test Case 6: ****END****
7: Test Case 7: ****START****
Test Case 7: FAILED: Remaining error values expected
VAL_SUCCESS(131)
Test Case 7: ****END****
8: Test Case 8: ****START****
Test Case 8: FAILED: Remaining error values expected
VAL_SUCCESS(131)
Test Case 8: ****END****
9: Test Case 9: ****START****
Test Case 9: FAILED: Remaining error values expected
VAL_SUCCESS(131)
Test Case 9: ****END****
10: Test Case 10: ****START****
Test Case 10: FAILED: Remaining error values expected
VAL_SUCCESS(131)
Test Case 10: ****END****
11: Test Case 11: ****START****
Test Case 11: FAILED: Remaining error values expected
VAL_SUCCESS(131)
Test Case 11: ****END****
12: Test Case 12: ****START****
Test Case 12: FAILED: Remaining error values expected
VAL_SUCCESS(131)
Test Case 12: ****END****
13: Test Case 13: ****START****
Test Case 13: FAILED: Remaining error values expected
VAL_SUCCESS(131)
Test Case 13: ****END****
14: Test Case 14: ****START****
Test Case 14: FAILED: Remaining error values expected
VAL_SUCCESS(131)
Test Case 14: ****END****
15: Test Case 15: ****START****
Test Case 15: FAILED: Remaining error values expected
VAL_SUCCESS(131)
Test Case 15: ****END****
16: Test Case 16: ****START****
Test Case 16: FAILED: Remaining error values expected
VAL_SUCCESS(131)
Test Case 16: ****END****
17: Test Case 17: ****START****
Test Case 17: FAILED: Remaining error values expected
VAL_SUCCESS(131)
Test Case 17: ****END****
18: Test Case 18: ****START****
Test Case 18: FAILED: Remaining error values expected
VAL_SUCCESS(131)
Test Case 18: ****END****
19: Test Case 19: ****START****
Test Case 19: FAILED: Remaining error values expected
VAL_SUCCESS(131)
Test Case 19: ****END****
20: Test Case 20: ****START****
Test Case 20: FAILED: Remaining error values expected
VAL_SUCCESS(131)
Test Case 20: ****END****
21: Test Case 21: ****START****
Test Case 21: FAILED: Remaining error values expected
VAL_SUCCESS(131)
Test Case 21: ****END****
22: Test Case 22: ****START****
Test Case 22: FAILED: Remaining error values expected
VAL_SUCCESS(131)
Test Case 22: ****END****
23: Test Case 23: ****START****
Test Case 23: FAILED: Remaining error values expected
VAL_SUCCESS(131)
Test Case 23: ****END****
24: Test Case 24: ****START****
Test Case 24: FAILED: Remaining error values expected
VAL_SUCCESS(131)
Test Case 24: ****END****
25: Test Case 25: ****START****
Test Case 25: FAILED: Remaining error values expected
VAL_SUCCESS(131)
Test Case 25: ****END****
26: Test Case 26: ****START****
Test Case 26: FAILED: Remaining error values expected
VAL_SUCCESS(131)
Test Case 26: ****END****
27: Test Case 27: ****START****
Test Case 27: FAILED: Remaining error values expected
VAL_SUCCESS(131)
Test Case 27: ****END****
28: Test Case 28: ****START****
Test Case 28: FAILED: Remaining error values expected
VAL_SUCCESS(131)
Test Case 28: ****END****
29: Test Case 29: ****START****
Test Case 29: FAILED: Remaining error values expected
VAL_SUCCESS(131)
Test Case 29: ****END****
30: Test Case 30: ****START****
Test Case 30: FAILED: Remaining error values expected
VAL_SUCCESS(131)
Test Case 30: ****END****
31: Test Case 31: ****START****
Test Case 31: FAILED: Remaining error values expected
VAL_SUCCESS(131)
Test Case 31: ****END****
32: Test Case 32: ****START****
Test Case 32: FAILED: Remaining error values expected
VAL_SUCCESS(131)
Test Case 32: ****END****
33: Test Case 33: ****START****
Test Case 33: FAILED: Remaining error values expected
VAL_SUCCESS(131)
Test Case 33: ****END****
34: Test Case 34: ****START****
Test Case 34: FAILED: Remaining error values expected
VAL_SUCCESS(131)
Test Case 34: ****END****
35: Test Case 35: ****START****
Test Case 35: FAILED: Remaining error values expected
VAL_SUCCESS(131)
Test Case 35: ****END****
36: Test Case 36: ****START****
Test Case 36: FAILED: Remaining error values expected
VAL_SUCCESS(131)
Test Case 36: ****END****
37: Test Case 37: ****START****
Test Case 37: FAILED: Remaining error values expected
VAL_SUCCESS(131)
Test Case 37: ****END****
38: Test Case 38: ****START****
Test Case 38: FAILED: Remaining error values expected
VAL_SUCCESS(131)
Test Case 38: ****END****
39: Test Case 39: ****START****
Test Case 39: FAILED: Remaining error values expected
VAL_SUCCESS(131)
Test Case 39: ****END****
40: Test Case 40: ****START****
Test Case 40: FAILED: Remaining error values expected
VAL_SUCCESS(131)
Test Case 40: ****END****
41: Test Case 41: ****START****
Test Case 41: FAILED: Remaining error values expected
VAL_SUCCESS(131)
Test Case 41: ****END****
42: Test Case 42: ****START****
Test Case 42: FAILED: Remaining error values expected
VAL_SUCCESS(131)
Test Case 42: ****END****
43: Test Case 43: ****START****
Test Case 43: FAILED: Remaining error values expected
VAL_SUCCESS(131)
Test Case 43: ****END****
44: Test Case 44: ****START****
Test Case 44: FAILED: Remaining error values expected
VAL_SUCCESS(131)
Test Case 44: ****END****
45: Test Case 45: ****START****
Test Case 45: FAILED: Remaining error values expected
VAL_SUCCESS(131)
Test Case 45: ****END****
46: Test Case 46: ****START****
Test Case 46: FAILED: Remaining error values expected
VAL_SUCCESS(131)
Test Case 46: ****END****
47: Test Case 47: ****START****
Test Case 47: FAILED: Remaining error values expected
VAL_SUCCESS(131)
Test Case 47: ****END****
48: Test Case 48: ****START****
Test Case 48: FAILED: Remaining error values expected
VAL_SUCCESS(131)
Test Case 48: ****END****
49: Test Case 49: ****START****
Test Case 49: FAILED: Remaining error values expected
VAL_SUCCESS(131)
Test Case 49: ****END****
Suite 'b.ws': Final results: 49/49 tests failed
Suite 'roll.ws': Running 5 tests
1: Test Case 1: ****START****
Test Case 1: FAILED: Remaining error values expected
VAL_SUCCESS(131)
Test Case 1: ****END****
2: Test Case 2: ****START****
Test Case 2: FAILED: Remaining error values expected
VAL_PROVABLY_UNSECURE(159)
Test Case 2: ****END****
3: Test Case 3: ****START****
Test Case 3: FAILED: Remaining error values expected
VAL_SUCCESS(131)
Test Case 3: ****END****
4: Test Case 4: ****START****
Test Case 4: FAILED: Remaining error values expected
VAL_SUCCESS(131)
Test Case 4: ****END****
5: Test Case 5: ****START****
Test Case 5: FAILED: Remaining error values expected
VAL_NONEXISTENT_NAME(168)
Test Case 5: ****END****
Suite 'roll.ws': Final results: 5/5 tests failed
Suite 'no.ws': Running 7 tests
1: Test Case 1: ****START****
Test Case 1: FAILED: Remaining error values expected
VAL_PROVABLY_UNSECURE(159)
Test Case 1: ****END****
2: Test Case 2: ****START****
Test Case 2: FAILED: Remaining error values expected
VAL_PROVABLY_UNSECURE(159)
Test Case 2: ****END****
3: Test Case 3: ****START****
Test Case 3: FAILED: Remaining error values expected
VAL_SUCCESS(131)
Test Case 3: ****END****
4: Test Case 4: ****START****
Test Case 4: FAILED: Remaining error values expected
VAL_PROVABLY_UNSECURE(159)
Test Case 4: ****END****
5: Test Case 5: ****START****
Test Case 5: FAILED: Remaining error values expected
VAL_PROVABLY_UNSECURE(159)
Test Case 5: ****END****
6: Test Case 6: ****START****
Test Case 6: FAILED: Remaining error values expected
VAL_SUCCESS(131)
Test Case 6: ****END****
7: Test Case 7: ****START****
Test Case 7: FAILED: Remaining error values expected
VAL_SUCCESS(131)
Test Case 7: ****END****
Suite 'no.ws': Final results: 7/7 tests failed
Suite '': Running 170 tests
1: Test Case 1: ****START****
Test Case 1: OK
Test Case 1: ****END****
2: Test Case 2: ****START****
Test Case 2: OK
Test Case 2: ****END****
3: Test Case 3: ****START****
Test Case 3: OK
Test Case 3: ****END****
4: Test Case 4: ****START****
Test Case 4: OK
Test Case 4: ****END****
5: Test Case 5: ****START****
Test Case 5: OK
Test Case 5: ****END****
6: Test Case 6: ****START****
Test Case 6: OK
Test Case 6: ****END****
7: Test Case 7: ****START****
Test Case 7: OK
Test Case 7: ****END****
8: Test Case 8: ****START****
Test Case 8: OK
Test Case 8: ****END****
9: Test Case 9: ****START****
Test Case 9: OK
Test Case 9: ****END****
10: Test Case 10: ****START****
Test Case 10: OK
Test Case 10: ****END****
11: Test Case 11: ****START****
Test Case 11: OK
Test Case 11: ****END****
12: Test Case 12: ****START****
Test Case 12: OK
Test Case 12: ****END****
13: Test Case 13: ****START****
Test Case 13: OK
Test Case 13: ****END****
14: Test Case 14: ****START****
Test Case 14: OK
Test Case 14: ****END****
15: Test Case 15: ****START****
Test Case 15: OK
Test Case 15: ****END****
16: Test Case 16: ****START****
Test Case 16: OK
Test Case 16: ****END****
17: Test Case 17: ****START****
Test Case 17: OK
Test Case 17: ****END****
18: Test Case 18: ****START****
Test Case 18: OK
Test Case 18: ****END****
19: Test Case 19: ****START****
Test Case 19: OK
Test Case 19: ****END****
20: Test Case 20: ****START****
Test Case 20: OK
Test Case 20: ****END****
21: Test Case 21: ****START****
Test Case 21: OK
Test Case 21: ****END****
22: Test Case 22: ****START****
Test Case 22: OK
Test Case 22: ****END****
23: Test Case 23: ****START****
Test Case 23: OK
Test Case 23: ****END****
24: Test Case 24: ****START****
Test Case 24: OK
Test Case 24: ****END****
25: Test Case 25: ****START****
Test Case 25: OK
Test Case 25: ****END****
26: Test Case 26: ****START****
Test Case 26: OK
Test Case 26: ****END****
27: Test Case 27: ****START****
Test Case 27: OK
Test Case 27: ****END****
28: Test Case 28: ****START****
Test Case 28: OK
Test Case 28: ****END****
29: Test Case 29: ****START****
Test Case 29: OK
Test Case 29: ****END****
30: Test Case 30: ****START****
Test Case 30: OK
Test Case 30: ****END****
31: Test Case 31: ****START****
Test Case 31: OK
Test Case 31: ****END****
32: Test Case 32: ****START****
Test Case 32: OK
Test Case 32: ****END****
33: Test Case 33: ****START****
Test Case 33: OK
Test Case 33: ****END****
34: Test Case 34: ****START****
Test Case 34: OK
Test Case 34: ****END****
35: Test Case 35: ****START****
Test Case 35: OK
Test Case 35: ****END****
36: Test Case 36: ****START****
Test Case 36: OK
Test Case 36: ****END****
37: Test Case 37: ****START****
Test Case 37: OK
Test Case 37: ****END****
38: Test Case 38: ****START****
Test Case 38: OK
Test Case 38: ****END****
39: Test Case 39: ****START****
Test Case 39: OK
Test Case 39: ****END****
40: Test Case 40: ****START****
Test Case 40: OK
Test Case 40: ****END****
41: Test Case 41: ****START****
Test Case 41: OK
Test Case 41: ****END****
42: Test Case 42: ****START****
Test Case 42: OK
Test Case 42: ****END****
43: Test Case 43: ****START****
Test Case 43: OK
Test Case 43: ****END****
44: Test Case 44: ****START****
Test Case 44: OK
Test Case 44: ****END****
45: Test Case 45: ****START****
Test Case 45: OK
Test Case 45: ****END****
46: Test Case 46: ****START****
Test Case 46: OK
Test Case 46: ****END****
47: Test Case 47: ****START****
Test Case 47: OK
Test Case 47: ****END****
48: Test Case 48: ****START****
Test Case 48: OK
Test Case 48: ****END****
49: Test Case 49: ****START****
Test Case 49: OK
Test Case 49: ****END****
50: Test Case 50: ****START****
Test Case 50: OK
Test Case 50: ****END****
51: Test Case 51: ****START****
Test Case 51: OK
Test Case 51: ****END****
52: Test Case 52: ****START****
Test Case 52: OK
Test Case 52: ****END****
53: Test Case 53: ****START****
Test Case 53: OK
Test Case 53: ****END****
54: Test Case 54: ****START****
Test Case 54: OK
Test Case 54: ****END****
55: Test Case 55: ****START****
Test Case 55: OK
Test Case 55: ****END****
56: Test Case 56: ****START****
Test Case 56: OK
Test Case 56: ****END****
57: Test Case 57: ****START****
Test Case 57: OK
Test Case 57: ****END****
58: Test Case 58: ****START****
Test Case 58: OK
Test Case 58: ****END****
59: Test Case 59: ****START****
Test Case 59: OK
Test Case 59: ****END****
60: Test Case 60: ****START****
Test Case 60: OK
Test Case 60: ****END****
61: Test Case 61: ****START****
Test Case 61: OK
Test Case 61: ****END****
62: Test Case 62: ****START****
Test Case 62: OK
Test Case 62: ****END****
63: Test Case 63: ****START****
Test Case 63: OK
Test Case 63: ****END****
64: Test Case 64: ****START****
Test Case 64: OK
Test Case 64: ****END****
65: Test Case 65: ****START****
Test Case 65: OK
Test Case 65: ****END****
66: Test Case 66: ****START****
Test Case 66: OK
Test Case 66: ****END****
67: Test Case 67: ****START****
Test Case 67: OK
Test Case 67: ****END****
68: Test Case 68: ****START****
Test Case 68: OK
Test Case 68: ****END****
69: Test Case 69: ****START****
Test Case 69: OK
Test Case 69: ****END****
70: Test Case 70: ****START****
Test Case 70: OK
Test Case 70: ****END****
71: Test Case 71: ****START****
Test Case 71: OK
Test Case 71: ****END****
72: Test Case 72: ****START****
Test Case 72: OK
Test Case 72: ****END****
73: Test Case 73: ****START****
Test Case 73: OK
Test Case 73: ****END****
74: Test Case 74: ****START****
Test Case 74: OK
Test Case 74: ****END****
75: Test Case 75: ****START****
Test Case 75: OK
Test Case 75: ****END****
76: Test Case 76: ****START****
Test Case 76: OK
Test Case 76: ****END****
77: Test Case 77: ****START****
Test Case 77: OK
Test Case 77: ****END****
78: Test Case 78: ****START****
Test Case 78: OK
Test Case 78: ****END****
79: Test Case 79: ****START****
Test Case 79: OK
Test Case 79: ****END****
80: Test Case 80: ****START****
Test Case 80: OK
Test Case 80: ****END****
81: Test Case 81: ****START****
Test Case 81: OK
Test Case 81: ****END****
82: Test Case 82: ****START****
Test Case 82: OK
Test Case 82: ****END****
83: Test Case 83: ****START****
Test Case 83: OK
Test Case 83: ****END****
84: Test Case 84: ****START****
Test Case 84: OK
Test Case 84: ****END****
85: Test Case 85: ****START****
Test Case 85: OK
Test Case 85: ****END****
86: Test Case 86: ****START****
Test Case 86: OK
Test Case 86: ****END****
87: Test Case 87: ****START****
Test Case 87: FAILED: Remaining error values expected
VAL_BOGUS(2)
Test Case 87: ****END****
88: Test Case 88: ****START****
Test Case 88: OK
Test Case 88: ****END****
89: Test Case 89: ****START****
Test Case 89: OK
Test Case 89: ****END****
90: Test Case 90: ****START****
Test Case 90: OK
Test Case 90: ****END****
91: Test Case 91: ****START****
Test Case 91: OK
Test Case 91: ****END****
92: Test Case 92: ****START****
Test Case 92: OK
Test Case 92: ****END****
93: Test Case 93: ****START****
Test Case 93: FAILED: Remaining error values expected
VAL_BOGUS(2)
Test Case 93: ****END****
94: Test Case 94: ****START****
Test Case 94: OK
Test Case 94: ****END****
95: Test Case 95: ****START****
Test Case 95: OK
Test Case 95: ****END****
96: Test Case 96: ****START****
Test Case 96: OK
Test Case 96: ****END****
97: Test Case 97: ****START****
Test Case 97: OK
Test Case 97: ****END****
98: Test Case 98: ****START****
Test Case 98: OK
Test Case 98: ****END****
99: Test Case 99: ****START****
Test Case 99: OK
Test Case 99: ****END****
100: Test Case 100: ****START****
Test Case 100: OK
Test Case 100: ****END****
101: Test Case 101: ****START****
Test Case 101: OK
Test Case 101: ****END****
102: Test Case 102: ****START****
Test Case 102: OK
Test Case 102: ****END****
103: Test Case 103: ****START****
Test Case 103: OK
Test Case 103: ****END****
104: Test Case 104: ****START****
Test Case 104: OK
Test Case 104: ****END****
105: Test Case 105: ****START****
Test Case 105: OK
Test Case 105: ****END****
106: Test Case 106: ****START****
Test Case 106: OK
Test Case 106: ****END****
107: Test Case 107: ****START****
Test Case 107: OK
Test Case 107: ****END****
108: Test Case 108: ****START****
Test Case 108: OK
Test Case 108: ****END****
109: Test Case 109: ****START****
Test Case 109: OK
Test Case 109: ****END****
110: Test Case 110: ****START****
Test Case 110: OK
Test Case 110: ****END****
111: Test Case 111: ****START****
Test Case 111: OK
Test Case 111: ****END****
112: Test Case 112: ****START****
Test Case 112: OK
Test Case 112: ****END****
113: Test Case 113: ****START****
Test Case 113: OK
Test Case 113: ****END****
114: Test Case 114: ****START****
Test Case 114: OK
Test Case 114: ****END****
115: Test Case 115: ****START****
Test Case 115: OK
Test Case 115: ****END****
116: Test Case 116: ****START****
Test Case 116: OK
Test Case 116: ****END****
117: Test Case 117: ****START****
Test Case 117: OK
Test Case 117: ****END****
118: Test Case 118: ****START****
Test Case 118: OK
Test Case 118: ****END****
119: Test Case 119: ****START****
Test Case 119: OK
Test Case 119: ****END****
120: Test Case 120: ****START****
Test Case 120: OK
Test Case 120: ****END****
121: Test Case 121: ****START****
Test Case 121: OK
Test Case 121: ****END****
122: Test Case 122: ****START****
Test Case 122: OK
Test Case 122: ****END****
123: Test Case 123: ****START****
Test Case 123: OK
Test Case 123: ****END****
124: Test Case 124: ****START****
Test Case 124: OK
Test Case 124: ****END****
125: Test Case 125: ****START****
Test Case 125: OK
Test Case 125: ****END****
126: Test Case 126: ****START****
Test Case 126: OK
Test Case 126: ****END****
127: Test Case 127: ****START****
Test Case 127: OK
Test Case 127: ****END****
128: Test Case 128: ****START****
Test Case 128: OK
Test Case 128: ****END****
129: Test Case 129: ****START****
Test Case 129: OK
Test Case 129: ****END****
130: Test Case 130: ****START****
Test Case 130: OK
Test Case 130: ****END****
131: Test Case 131: ****START****
Test Case 131: OK
Test Case 131: ****END****
132: Test Case 132: ****START****
Test Case 132: OK
Test Case 132: ****END****
133: Test Case 133: ****START****
Test Case 133: OK
Test Case 133: ****END****
134: Test Case 134: ****START****
Test Case 134: OK
Test Case 134: ****END****
135: Test Case 135: ****START****
Test Case 135: OK
Test Case 135: ****END****
136: Test Case 136: ****START****
Test Case 136: OK
Test Case 136: ****END****
137: Test Case 137: ****START****
Test Case 137: OK
Test Case 137: ****END****
138: Test Case 138: ****START****
Test Case 138: OK
Test Case 138: ****END****
139: Test Case 139: ****START****
Test Case 139: OK
Test Case 139: ****END****
140: Test Case 140: ****START****
Test Case 140: OK
Test Case 140: ****END****
141: Test Case 141: ****START****
Test Case 141: OK
Test Case 141: ****END****
142: Test Case 142: ****START****
Test Case 142: OK
Test Case 142: ****END****
143: Test Case 143: ****START****
Test Case 143: OK
Test Case 143: ****END****
144: Test Case 144: ****START****
Test Case 144: OK
Test Case 144: ****END****
145: Test Case 145: ****START****
Test Case 145: OK
Test Case 145: ****END****
146: Test Case 146: ****START****
Test Case 146: OK
Test Case 146: ****END****
147: Test Case 147: ****START****
Test Case 147: OK
Test Case 147: ****END****
148: Test Case 148: ****START****
Test Case 148: OK
Test Case 148: ****END****
149: Test Case 149: ****START****
Test Case 149: OK
Test Case 149: ****END****
150: Test Case 150: ****START****
Test Case 150: OK
Test Case 150: ****END****
151: Test Case 151: ****START****
Test Case 151: OK
Test Case 151: ****END****
152: Test Case 152: ****START****
Test Case 152: OK
Test Case 152: ****END****
153: Test Case 153: ****START****
Test Case 153: OK
Test Case 153: ****END****
154: Test Case 154: ****START****
Test Case 154: OK
Test Case 154: ****END****
155: Test Case 155: ****START****
Test Case 155: OK
Test Case 155: ****END****
156: Test Case 156: ****START****
Test Case 156: OK
Test Case 156: ****END****
157: Test Case 157: ****START****
Test Case 157: OK
Test Case 157: ****END****
158: Test Case 158: ****START****
Test Case 158: OK
Test Case 158: ****END****
159: Test Case 159: ****START****
Test Case 159: OK
Test Case 159: ****END****
160: Test Case 160: ****START****
Test Case 160: OK
Test Case 160: ****END****
161: Test Case 161: ****START****
Test Case 161: OK
Test Case 161: ****END****
162: Test Case 162: ****START****
Test Case 162: OK
Test Case 162: ****END****
163: Test Case 163: ****START****
Test Case 163: OK
Test Case 163: ****END****
164: Test Case 164: ****START****
Test Case 164: OK
Test Case 164: ****END****
165: Test Case 165: ****START****
Test Case 165: OK
Test Case 165: ****END****
166: Test Case 166: ****START****
Test Case 166: OK
Test Case 166: ****END****
167: Test Case 167: ****START****
Test Case 167: OK
Test Case 167: ****END****
168: Test Case 168: ****START****
Test Case 168: OK
Test Case 168: ****END****
169: Test Case 169: ****START****
Test Case 169: OK
Test Case 169: ****END****
170: Test Case 170: ****START****
Test Case 170: OK
Test Case 170: ****END****
Suite '': Final results: 2/170 tests failed