All pastes #459559 Raw Edit

Untitled

public text v1 · immutable
#459559 ·published 2007-04-26 15:36 UTC
rendered paste body
[root@corona slony1-1.2.9]# ./configure
checking build system type... i686-pc-linux-gnu
checking host system type... i686-pc-linux-gnu
checking which template to use... linux
configure: using CFLAGS=
checking for gcc... gcc
checking for C compiler default output file name... a.out
checking whether the C compiler works... yes
checking whether we are cross compiling... no
checking for suffix of executables...
checking for suffix of object files... o
checking whether we are using the GNU C compiler... yes
checking whether gcc accepts -g... yes
checking for gcc option to accept ISO C89... none needed
checking for ld used by GCC... /usr/bin/ld
checking if the linker (/usr/bin/ld) is GNU ld... yes
checking for perl... /usr/bin/perl
checking for tar... /bin/tar
checking for flex... no
checking for ,... no
checking for lex... no
checking for bison... no
checking for ,... no
checking for yacc... no
checking for sed... sed
checking for the pthreads library -lpthreads... no
checking whether pthreads work without any flags... no
checking whether pthreads work with -Kthread... no
checking whether pthreads work with -kthread... no
checking for the pthreads library -llthread... no
checking whether pthreads work with -pthread... yes
checking for joinable pthread attribute... PTHREAD_CREATE_JOINABLE
checking if more special flags are required for pthreads... no
checking for cc_r... gcc
checking how to run the C preprocessor... gcc -E
checking for grep that handles long lines and -e... /bin/grep
checking for egrep... /bin/grep -E
checking for ANSI C header files... yes
checking for sys/types.h... yes
checking for sys/stat.h... yes
checking for stdlib.h... yes
checking for string.h... yes
checking for memory.h... yes
checking for strings.h... yes
checking for inttypes.h... yes
checking for stdint.h... yes
checking for unistd.h... yes
checking fcntl.h usability... yes
checking fcntl.h presence... yes
checking for fcntl.h... yes
checking limits.h usability... yes
checking limits.h presence... yes
checking for limits.h... yes
checking stddef.h usability... yes
checking stddef.h presence... yes
checking for stddef.h... yes
checking sys/socket.h usability... yes
checking sys/socket.h presence... yes
checking for sys/socket.h... yes
checking sys/time.h usability... yes
checking sys/time.h presence... yes
checking for sys/time.h... yes
checking for inttypes.h... (cached) yes
checking for gettimeofday... yes
checking for dup2... yes
checking for alarm... yes
checking for memset... yes
checking for select... yes
checking for strdup... yes
checking for strerror... yes
checking for strtol... yes
checking for strtoul... yes
checking for int32_t... yes
checking for uint32_t... yes
checking for u_int32_t... yes
checking for int64_t... yes
checking for uint64_t... yes
checking for u_int64_t... yes
checking for ssize_t... yes
checking for POSIX signal interface... yes
checking if you have requested slony1-engine building... yes
checking for pg_config... /usr/bin/pg_config
pg_config says pg_bindir is /usr/bin/
pg_config says pg_libdir is /usr/lib/
pg_config says pg_includedir is /usr/include/pgsql/
pg_config says pg_pkglibdir is /usr/lib/pgsql/
pg_config says pg_includeserverdir is /usr/include/pgsql/server/
checking for correct version of PostgreSQL... 8.2
pg_config says pg_sharedir is /usr/share/pgsql/
checking for PQunescapeBytea in -lpq... yes
checking libpq-fe.h usability... yes
checking libpq-fe.h presence... yes
checking for libpq-fe.h... yes
checking postgres.h usability... yes
checking postgres.h presence... yes
checking for postgres.h... yes
checking for utils/typcache.h... yes
checking for plpgsql.so... yes
checking for postgresql.conf.sample... skipped due to override
checking for PQputCopyData in -lpq... yes
checking for PQsetNoticeReceiver in -lpq... yes
checking for PQfreemem in -lpq... yes
checking for typenameTypeId... yes, and it takes 2 arguments
checking for standard_conforming_strings... yes
checking whether GetTopTransactionId is declared... yes
checking if you have requested documentation building... no
configure: creating ./config.status
config.status: creating Makefile.global
config.status: WARNING:  Makefile.global.in seems to ignore the --datarootdir setting
config.status: creating GNUmakefile
config.status: creating postgresql-slony1-engine.spec
config.status: creating Makefile.port
config.status: creating config.h
[root@corona slony1-1.2.9]# make rpm
rm -rf postgresql-slony1-engine-1.2.9* =install=
for x in `cd . && find . -name CVS -prune -o -print`; do \
          file=`expr X$x : 'X\./\(.*\)'`; \
          if test -d "./$file" ; then \
            mkdir "postgresql-slony1-engine-1.2.9/$file" && chmod 777 "postgresql-slony1-engine-1.2.9/$file"; \
          else \
            ln "./$file" "postgresql-slony1-engine-1.2.9/$file" >/dev/null 2>&1 \
              || cp "./$file" "postgresql-slony1-engine-1.2.9/$file"; \
          fi || exit; \
        done
/bin/tar cf postgresql-slony1-engine-1.2.9.tar postgresql-slony1-engine-1.2.9
gzip --best postgresql-slony1-engine-1.2.9.tar
rm -rf postgresql-slony1-engine-1.2.9
rpmbuild -ta postgresql-slony1-engine-1.2.9.tar.gz
sh: line 0: fg: no job control
Executing(%prep): /bin/sh -e /var/tmp/rpm-tmp.97158
+ umask 022
+ cd /usr/src/rpm/BUILD
+ '[' 1 -eq 1 ']'
+ '[' 1 -eq 1 ']'
+ '[' 1 -eq 1 ']'
+ cd /usr/src/rpm/BUILD
+ rm -rf postgresql-slony1-engine-1.2.9
+ /usr/bin/gzip -dc /home/mwatts/slony1-1.2.9/postgresql-slony1-engine-1.2.9.tar.gz
+ tar -xf -
+ STATUS=0
+ '[' 0 -ne 0 ']'
+ cd postgresql-slony1-engine-1.2.9
+ exit 0
Executing(%build): /bin/sh -e /var/tmp/rpm-tmp.97158
+ umask 022
+ cd /usr/src/rpm/BUILD
+ cd postgresql-slony1-engine-1.2.9
+ '[' 1 -eq 1 ']'
+ '[' 1 -eq 1 ']'
+ CFLAGS='-O2 -g -pipe -Wp,-D_FORTIFY_SOURCE=2 -fexceptions -fomit-frame-pointer -march=i586 -mtune=generic -fasynchronous-unwind-tables'
+ export CFLAGS
+ CXXFLAGS='-O2 -g -pipe -Wp,-D_FORTIFY_SOURCE=2 -fexceptions -fomit-frame-pointer -march=i586 -mtune=generic -fasynchronous-unwind-tables'
+ export CXXFLAGS
+ CPPFLAGS=' -I/usr/include/et -I/usr/include'
+ export CPPFLAGS
+ CFLAGS='-O2 -g -pipe -Wp,-D_FORTIFY_SOURCE=2 -fexceptions -fomit-frame-pointer -march=i586 -mtune=generic -fasynchronous-unwind-tables -I/usr/include/et -I/usr/include'
+ export CFLAGS
++ echo -O2 -g -pipe -Wp,-D_FORTIFY_SOURCE=2 -fexceptions -fomit-frame-pointer -march=i586 -mtune=generic -fasynchronous-unwind-tables -I/usr/include/et -I/usr/include
++ xargs -n 1
++ grep -v ffast-math
++ xargs -n 100
+ CFLAGS='-O2 -g -pipe -Wp,-D_FORTIFY_SOURCE=2 -fexceptions -fomit-frame-pointer -march=i586 -mtune=generic -fasynchronous-unwind-tables -I/usr/include/et -I/usr/include'
+ export LIBNAME=lib
+ LIBNAME=lib
+ ./configure --includedir /usr/include/pgsql --with-perltools=/usr/bin --with-toolsbin=/usr/bin --with-docs --with-docdir=/usr/share/doc/postgresql-slony1-engine-1.2.9 --datadir /usr/share/pgsql --sysconfdir=/etc --with-pglibdir=/usr/lib/pgsql
checking build system type... i686-pc-linux-gnu
checking host system type... i686-pc-linux-gnu
checking which template to use... linux
configure: using CFLAGS=-O2 -g -pipe -Wp,-D_FORTIFY_SOURCE=2 -fexceptions -fomit-frame-pointer -march=i586 -mtune=generic -fasynchronous-unwind-tables -I/usr/include/et -I/usr/include
checking for gcc... gcc
checking for C compiler default output file name... a.out
checking whether the C compiler works... yes
checking whether we are cross compiling... no
checking for suffix of executables...
checking for suffix of object files... o
checking whether we are using the GNU C compiler... yes
checking whether gcc accepts -g... yes
checking for gcc option to accept ISO C89... none needed
checking for ld used by GCC... /usr/bin/ld
checking if the linker (/usr/bin/ld) is GNU ld... yes
checking for perl... /usr/bin/perl
checking for tar... /bin/tar
checking for flex... no
checking for ,... no
checking for lex... no
checking for bison... no
checking for ,... no
checking for yacc... no
checking for sed... sed
checking for the pthreads library -lpthreads... no
checking whether pthreads work without any flags... no
checking whether pthreads work with -Kthread... no
checking whether pthreads work with -kthread... no
checking for the pthreads library -llthread... no
checking whether pthreads work with -pthread... yes
checking for joinable pthread attribute... PTHREAD_CREATE_JOINABLE
checking if more special flags are required for pthreads... no
checking for cc_r... gcc
checking how to run the C preprocessor... gcc -E
checking for grep that handles long lines and -e... /bin/grep
checking for egrep... /bin/grep -E
checking for ANSI C header files... yes
checking for sys/types.h... yes
checking for sys/stat.h... yes
checking for stdlib.h... yes
checking for string.h... yes
checking for memory.h... yes
checking for strings.h... yes
checking for inttypes.h... yes
checking for stdint.h... yes
checking for unistd.h... yes
checking fcntl.h usability... yes
checking fcntl.h presence... yes
checking for fcntl.h... yes
checking limits.h usability... yes
checking limits.h presence... yes
checking for limits.h... yes
checking stddef.h usability... yes
checking stddef.h presence... yes
checking for stddef.h... yes
checking sys/socket.h usability... yes
checking sys/socket.h presence... yes
checking for sys/socket.h... yes
checking sys/time.h usability... yes
checking sys/time.h presence... yes
checking for sys/time.h... yes
checking for inttypes.h... (cached) yes
checking for gettimeofday... yes
checking for dup2... yes
checking for alarm... yes
checking for memset... yes
checking for select... yes
checking for strdup... yes
checking for strerror... yes
checking for strtol... yes
checking for strtoul... yes
checking for int32_t... yes
checking for uint32_t... yes
checking for u_int32_t... yes
checking for int64_t... yes
checking for uint64_t... yes
checking for u_int64_t... yes
checking for ssize_t... yes
checking for POSIX signal interface... yes
checking if you have requested slony1-engine building... yes
overriding pglibdir with /usr/lib/pgsql
checking for pg_config... /usr/bin/pg_config
pg_config says pg_bindir is /usr/bin/
pg_config says pg_includedir is /usr/include/pgsql/
pg_config says pg_pkglibdir is /usr/lib/pgsql/
pg_config says pg_includeserverdir is /usr/include/pgsql/server/
checking for correct version of PostgreSQL... 8.2
pg_config says pg_sharedir is /usr/share/pgsql/
checking for PQunescapeBytea in -lpq... yes
checking libpq-fe.h usability... yes
checking libpq-fe.h presence... yes
checking for libpq-fe.h... yes
checking postgres.h usability... yes
checking postgres.h presence... yes
checking for postgres.h... yes
checking for utils/typcache.h... yes
checking for plpgsql.so... yes
checking for postgresql.conf.sample... skipped due to override
checking for PQputCopyData in -lpq... yes
checking for PQsetNoticeReceiver in -lpq... yes
checking for PQfreemem in -lpq... yes
checking for typenameTypeId... yes, and it takes 2 arguments
checking for standard_conforming_strings... yes
checking whether GetTopTransactionId is declared... yes
checking for DBI::Pg... checking if you have requested documentation building... yes
checking for groff... groff
checking for ps2pdf... no
checking for eps2pdf... no
checking for djpeg... no
checking for pnmtops... no
checking for convert... no
checking for postgresql_autodoc... no
checking for pgautodoc... no
checking for onsgmls... onsgmls
checking for sgmlspl... no
checking for docbook2man-spec.pl... not found, skipping manpages.
Please use --with-d2mdir to specify the path to docbook2man-spec.pl
checking for openjade... openjade
checking for DocBook V4.2... no
checking for DocBook stylesheets... /usr/share/sgml/docbook/dsssl-stylesheets
checking for collateindex.pl... /usr/bin/collateindex.pl
configure: creating ./config.status
config.status: creating Makefile.global
config.status: WARNING:  Makefile.global.in seems to ignore the --datarootdir setting
config.status: creating GNUmakefile
config.status: creating postgresql-slony1-engine.spec
config.status: creating Makefile.port
config.status: creating config.h
config.status: config.h is unchanged
+ autoconf
+ make
make[1]: Entering directory `/usr/src/rpm/BUILD/postgresql-slony1-engine-1.2.9'
make[2]: Entering directory `/usr/src/rpm/BUILD/postgresql-slony1-engine-1.2.9/src'
make[3]: Entering directory `/usr/src/rpm/BUILD/postgresql-slony1-engine-1.2.9/src/xxid'
gcc -O2 -g -pipe -Wp,-D_FORTIFY_SOURCE=2 -fexceptions -fomit-frame-pointer -march=i586 -mtune=generic -fasynchronous-unwind-tables -I/usr/include/et -I/usr/include -Wall -Wmissing-prototypes -Wmissing-declarations -fpic -I../.. -I/usr/include/pgsql/ -I/usr/include/pgsql/server/ -I/usr/include/pgsql/ -I/usr/include/pgsql/server/ -I/usr/include/pgsql/ -I/usr/include/pgsql/server/  -I/usr/include/et -I/usr/include -c -o xxid.o xxid.c
gcc -shared -o xxid.so xxid.o
cp xxid.v74.sql xxid.v80.sql
cp xxid.v80.sql xxid.v81.sql
make[3]: Leaving directory `/usr/src/rpm/BUILD/postgresql-slony1-engine-1.2.9/src/xxid'
make[3]: Entering directory `/usr/src/rpm/BUILD/postgresql-slony1-engine-1.2.9/src/parsestatements'
gcc -O2 -g -pipe -Wp,-D_FORTIFY_SOURCE=2 -fexceptions -fomit-frame-pointer -march=i586 -mtune=generic -fasynchronous-unwind-tables -I/usr/include/et -I/usr/include -Wall -Wmissing-prototypes -Wmissing-declarations -I/usr/include/pgsql/ -I/usr/include/pgsql/server/ -I/usr/include/pgsql/ -I/usr/include/pgsql/server/ -I/usr/include/pgsql/ -I/usr/include/pgsql/server/  -I/usr/include/et -I/usr/include -c -o test-scanner.o test-scanner.c
test-scanner.c: In function âmainâ:
test-scanner.c:14: warning: ignoring return value of âfreadâ, declared with attribute warn_unused_result
gcc -O2 -g -pipe -Wp,-D_FORTIFY_SOURCE=2 -fexceptions -fomit-frame-pointer -march=i586 -mtune=generic -fasynchronous-unwind-tables -I/usr/include/et -I/usr/include -Wall -Wmissing-prototypes -Wmissing-declarations -I/usr/include/pgsql/ -I/usr/include/pgsql/server/ -I/usr/include/pgsql/ -I/usr/include/pgsql/server/ -I/usr/include/pgsql/ -I/usr/include/pgsql/server/  -I/usr/include/et -I/usr/include -c -o scanner.o scanner.c
gcc -O2 -g -pipe -Wp,-D_FORTIFY_SOURCE=2 -fexceptions -fomit-frame-pointer -march=i586 -mtune=generic -fasynchronous-unwind-tables -I/usr/include/et -I/usr/include -Wall -Wmissing-prototypes -Wmissing-declarations -o test-scanner test-scanner.c scanner.o
test-scanner.c: In function âmainâ:
test-scanner.c:14: warning: ignoring return value of âfreadâ, declared with attribute warn_unused_result
./test-scanner < /dev/null > emptytestresult.log
cmp ./emptytestresult.log emptytestresult.expected
./test-scanner < ./test_sql.sql > test_sql.log
cmp ./test_sql.log ./test_sql.expected
make[3]: Leaving directory `/usr/src/rpm/BUILD/postgresql-slony1-engine-1.2.9/src/parsestatements'
make[3]: Entering directory `/usr/src/rpm/BUILD/postgresql-slony1-engine-1.2.9/src/slon'
gcc -O2 -g -pipe -Wp,-D_FORTIFY_SOURCE=2 -fexceptions -fomit-frame-pointer -march=i586 -mtune=generic -fasynchronous-unwind-tables -I/usr/include/et -I/usr/include -Wall -Wmissing-prototypes -Wmissing-declarations -pthread -I../.. -I../../src/slon -I/usr/include/pgsql/ -I/usr/include/pgsql/server/ -I/usr/include/pgsql/ -I/usr/include/pgsql/server/ -I/usr/include/pgsql/ -I/usr/include/pgsql/server/  -I/usr/include/et -I/usr/include -c -o slon.o slon.c
gcc -O2 -g -pipe -Wp,-D_FORTIFY_SOURCE=2 -fexceptions -fomit-frame-pointer -march=i586 -mtune=generic -fasynchronous-unwind-tables -I/usr/include/et -I/usr/include -Wall -Wmissing-prototypes -Wmissing-declarations -pthread -I../.. -I../../src/slon -I/usr/include/pgsql/ -I/usr/include/pgsql/server/ -I/usr/include/pgsql/ -I/usr/include/pgsql/server/ -I/usr/include/pgsql/ -I/usr/include/pgsql/server/  -I/usr/include/et -I/usr/include -c -o runtime_config.o runtime_config.c
gcc -O2 -g -pipe -Wp,-D_FORTIFY_SOURCE=2 -fexceptions -fomit-frame-pointer -march=i586 -mtune=generic -fasynchronous-unwind-tables -I/usr/include/et -I/usr/include -Wall -Wmissing-prototypes -Wmissing-declarations -pthread -I../.. -I../../src/slon -I/usr/include/pgsql/ -I/usr/include/pgsql/server/ -I/usr/include/pgsql/ -I/usr/include/pgsql/server/ -I/usr/include/pgsql/ -I/usr/include/pgsql/server/  -I/usr/include/et -I/usr/include -c -o local_listen.o local_listen.c
gcc -O2 -g -pipe -Wp,-D_FORTIFY_SOURCE=2 -fexceptions -fomit-frame-pointer -march=i586 -mtune=generic -fasynchronous-unwind-tables -I/usr/include/et -I/usr/include -Wall -Wmissing-prototypes -Wmissing-declarations -pthread -I../.. -I../../src/slon -I/usr/include/pgsql/ -I/usr/include/pgsql/server/ -I/usr/include/pgsql/ -I/usr/include/pgsql/server/ -I/usr/include/pgsql/ -I/usr/include/pgsql/server/  -I/usr/include/et -I/usr/include -c -o remote_listen.o remote_listen.c
gcc -O2 -g -pipe -Wp,-D_FORTIFY_SOURCE=2 -fexceptions -fomit-frame-pointer -march=i586 -mtune=generic -fasynchronous-unwind-tables -I/usr/include/et -I/usr/include -Wall -Wmissing-prototypes -Wmissing-declarations -pthread -I../.. -I../../src/slon -I/usr/include/pgsql/ -I/usr/include/pgsql/server/ -I/usr/include/pgsql/ -I/usr/include/pgsql/server/ -I/usr/include/pgsql/ -I/usr/include/pgsql/server/  -I/usr/include/et -I/usr/include -c -o remote_worker.o remote_worker.c
remote_worker.c: In function âsync_eventâ:
remote_worker.c:4867: warning: ignoring return value of âsystemâ, declared with attribute warn_unused_result
gcc -O2 -g -pipe -Wp,-D_FORTIFY_SOURCE=2 -fexceptions -fomit-frame-pointer -march=i586 -mtune=generic -fasynchronous-unwind-tables -I/usr/include/et -I/usr/include -Wall -Wmissing-prototypes -Wmissing-declarations -pthread -I../.. -I../../src/slon -I/usr/include/pgsql/ -I/usr/include/pgsql/server/ -I/usr/include/pgsql/ -I/usr/include/pgsql/server/ -I/usr/include/pgsql/ -I/usr/include/pgsql/server/  -I/usr/include/et -I/usr/include -c -o sync_thread.o sync_thread.c
gcc -O2 -g -pipe -Wp,-D_FORTIFY_SOURCE=2 -fexceptions -fomit-frame-pointer -march=i586 -mtune=generic -fasynchronous-unwind-tables -I/usr/include/et -I/usr/include -Wall -Wmissing-prototypes -Wmissing-declarations -pthread -I../.. -I../../src/slon -I/usr/include/pgsql/ -I/usr/include/pgsql/server/ -I/usr/include/pgsql/ -I/usr/include/pgsql/server/ -I/usr/include/pgsql/ -I/usr/include/pgsql/server/  -I/usr/include/et -I/usr/include -c -o cleanup_thread.o cleanup_thread.c
gcc -O2 -g -pipe -Wp,-D_FORTIFY_SOURCE=2 -fexceptions -fomit-frame-pointer -march=i586 -mtune=generic -fasynchronous-unwind-tables -I/usr/include/et -I/usr/include -Wall -Wmissing-prototypes -Wmissing-declarations -pthread -I../.. -I../../src/slon -I/usr/include/pgsql/ -I/usr/include/pgsql/server/ -I/usr/include/pgsql/ -I/usr/include/pgsql/server/ -I/usr/include/pgsql/ -I/usr/include/pgsql/server/  -I/usr/include/et -I/usr/include -c -o scheduler.o scheduler.c
gcc -O2 -g -pipe -Wp,-D_FORTIFY_SOURCE=2 -fexceptions -fomit-frame-pointer -march=i586 -mtune=generic -fasynchronous-unwind-tables -I/usr/include/et -I/usr/include -Wall -Wmissing-prototypes -Wmissing-declarations -pthread -I../.. -I../../src/slon -I/usr/include/pgsql/ -I/usr/include/pgsql/server/ -I/usr/include/pgsql/ -I/usr/include/pgsql/server/ -I/usr/include/pgsql/ -I/usr/include/pgsql/server/  -I/usr/include/et -I/usr/include -c -o dbutils.o dbutils.c
gcc -O2 -g -pipe -Wp,-D_FORTIFY_SOURCE=2 -fexceptions -fomit-frame-pointer -march=i586 -mtune=generic -fasynchronous-unwind-tables -I/usr/include/et -I/usr/include -Wall -Wmissing-prototypes -Wmissing-declarations -pthread -I../.. -I../../src/slon -I/usr/include/pgsql/ -I/usr/include/pgsql/server/ -I/usr/include/pgsql/ -I/usr/include/pgsql/server/ -I/usr/include/pgsql/ -I/usr/include/pgsql/server/  -I/usr/include/et -I/usr/include -c -o conf-file.o conf-file.c
<stdout>:1614: warning: no previous prototype for âyyget_linenoâ
<stdout>:1623: warning: no previous prototype for âyyget_inâ
<stdout>:1631: warning: no previous prototype for âyyget_outâ
<stdout>:1639: warning: no previous prototype for âyyget_lengâ
<stdout>:1648: warning: no previous prototype for âyyget_textâ
<stdout>:1657: warning: no previous prototype for âyyset_linenoâ
<stdout>:1669: warning: no previous prototype for âyyset_inâ
<stdout>:1674: warning: no previous prototype for âyyset_outâ
<stdout>:1679: warning: no previous prototype for âyyget_debugâ
<stdout>:1684: warning: no previous prototype for âyyset_debugâ
<stdout>:1718: warning: no previous prototype for âyylex_destroyâ
slon/conf-file.l:116: warning: no previous prototype for âProcessConfigFileâ
gcc -O2 -g -pipe -Wp,-D_FORTIFY_SOURCE=2 -fexceptions -fomit-frame-pointer -march=i586 -mtune=generic -fasynchronous-unwind-tables -I/usr/include/et -I/usr/include -Wall -Wmissing-prototypes -Wmissing-declarations -pthread -I../.. -I../../src/slon -I/usr/include/pgsql/ -I/usr/include/pgsql/server/ -I/usr/include/pgsql/ -I/usr/include/pgsql/server/ -I/usr/include/pgsql/ -I/usr/include/pgsql/server/  -I/usr/include/et -I/usr/include -c -o confoptions.o confoptions.c
confoptions.c:31: warning: no previous prototype for âbuild_conf_variablesâ
gcc -O2 -g -pipe -Wp,-D_FORTIFY_SOURCE=2 -fexceptions -fomit-frame-pointer -march=i586 -mtune=generic -fasynchronous-unwind-tables -I/usr/include/et -I/usr/include -Wall -Wmissing-prototypes -Wmissing-declarations -pthread -I../.. -I../../src/slon -I/usr/include/pgsql/ -I/usr/include/pgsql/server/ -I/usr/include/pgsql/ -I/usr/include/pgsql/server/ -I/usr/include/pgsql/ -I/usr/include/pgsql/server/  -I/usr/include/et -I/usr/include -c -o misc.o misc.c
misc.c: In function âslon_logâ:
misc.c:195: warning: ignoring return value of âfwriteâ, declared with attribute warn_unused_result
gcc -O2 -g -pipe -Wp,-D_FORTIFY_SOURCE=2 -fexceptions -fomit-frame-pointer -march=i586 -mtune=generic -fasynchronous-unwind-tables -I/usr/include/et -I/usr/include -Wall -Wmissing-prototypes -Wmissing-declarations -pthread -I../.. -I../../src/slon -o slon slon.o runtime_config.o local_listen.o remote_listen.o remote_worker.o sync_thread.o cleanup_thread.o scheduler.o dbutils.o conf-file.o confoptions.o misc.o ../parsestatements/scanner.o -pthread -L/usr/lib/pgsql -L/usr/lib/pgsql/ -lpq  -Wl,-rpath,/usr/lib/pgsql
make[3]: Leaving directory `/usr/src/rpm/BUILD/postgresql-slony1-engine-1.2.9/src/slon'
make[3]: Entering directory `/usr/src/rpm/BUILD/postgresql-slony1-engine-1.2.9/src/slonik'
gcc -O2 -g -pipe -Wp,-D_FORTIFY_SOURCE=2 -fexceptions -fomit-frame-pointer -march=i586 -mtune=generic -fasynchronous-unwind-tables -I/usr/include/et -I/usr/include -Wall -Wmissing-prototypes -Wmissing-declarations -I../.. -DPGSHARE="\"/usr/share/pgsql/\""  -I/usr/include/pgsql/ -I/usr/include/pgsql/server/ -I/usr/include/pgsql/ -I/usr/include/pgsql/server/ -I/usr/include/pgsql/ -I/usr/include/pgsql/server/  -I/usr/include/et -I/usr/include -c -o slonik.o slonik.c
gcc -O2 -g -pipe -Wp,-D_FORTIFY_SOURCE=2 -fexceptions -fomit-frame-pointer -march=i586 -mtune=generic -fasynchronous-unwind-tables -I/usr/include/et -I/usr/include -Wall -Wmissing-prototypes -Wmissing-declarations -I../.. -DPGSHARE="\"/usr/share/pgsql/\""  -I/usr/include/pgsql/ -I/usr/include/pgsql/server/ -I/usr/include/pgsql/ -I/usr/include/pgsql/server/ -I/usr/include/pgsql/ -I/usr/include/pgsql/server/  -I/usr/include/et -I/usr/include -c -o dbutil.o dbutil.c
gcc -O2 -g -pipe -Wp,-D_FORTIFY_SOURCE=2 -fexceptions -fomit-frame-pointer -march=i586 -mtune=generic -fasynchronous-unwind-tables -I/usr/include/et -I/usr/include -Wall -Wmissing-prototypes -Wmissing-declarations -I../.. -DPGSHARE="\"/usr/share/pgsql/\""  -I/usr/include/pgsql/ -I/usr/include/pgsql/server/ -I/usr/include/pgsql/ -I/usr/include/pgsql/server/ -I/usr/include/pgsql/ -I/usr/include/pgsql/server/  -I/usr/include/et -I/usr/include -c -o parser.o parser.c
In file included from slonik/parser.y:1945:
<stdout>: In function âyylexâ:
slonik/scan.l:205: warning: ignoring return value of âfwriteâ, declared with attribute warn_unused_result
<stdout>: At top level:
<stdout>:2294: warning: no previous prototype for âyyget_linenoâ
<stdout>:2303: warning: no previous prototype for âyyget_inâ
<stdout>:2311: warning: no previous prototype for âyyget_outâ
<stdout>:2319: warning: no previous prototype for âyyget_lengâ
<stdout>:2328: warning: no previous prototype for âyyget_textâ
<stdout>:2337: warning: no previous prototype for âyyset_linenoâ
<stdout>:2349: warning: no previous prototype for âyyset_inâ
<stdout>:2354: warning: no previous prototype for âyyset_outâ
<stdout>:2359: warning: no previous prototype for âyyget_debugâ
<stdout>:2364: warning: no previous prototype for âyyset_debugâ
<stdout>:2401: warning: no previous prototype for âyylex_destroyâ
gcc -O2 -g -pipe -Wp,-D_FORTIFY_SOURCE=2 -fexceptions -fomit-frame-pointer -march=i586 -mtune=generic -fasynchronous-unwind-tables -I/usr/include/et -I/usr/include -Wall -Wmissing-prototypes -Wmissing-declarations -I../.. -DPGSHARE="\"/usr/share/pgsql/\""  slonik.o dbutil.o parser.o  ../parsestatements/scanner.o -L/usr/lib/pgsql -L/usr/lib/pgsql/ -lpq  -Wl,-rpath,/usr/lib/pgsql -o slonik
make[3]: Leaving directory `/usr/src/rpm/BUILD/postgresql-slony1-engine-1.2.9/src/slonik'
make[3]: Entering directory `/usr/src/rpm/BUILD/postgresql-slony1-engine-1.2.9/src/backend'
gcc -O2 -g -pipe -Wp,-D_FORTIFY_SOURCE=2 -fexceptions -fomit-frame-pointer -march=i586 -mtune=generic -fasynchronous-unwind-tables -I/usr/include/et -I/usr/include -Wall -Wmissing-prototypes -Wmissing-declarations -I../.. -fpic -I/usr/include/pgsql/ -I/usr/include/pgsql/server/ -I/usr/include/pgsql/ -I/usr/include/pgsql/server/ -I/usr/include/pgsql/ -I/usr/include/pgsql/server/  -I/usr/include/et -I/usr/include -c -o slony1_funcs.o slony1_funcs.c
slony1_funcs.c: In function âslon_quote_literalâ:
slony1_funcs.c:1100: warning: pointer targets in passing argument 1 of âpg_mblenâ differ in signedness
gcc -shared -o slony1_funcs.so slony1_funcs.o
make[3]: Leaving directory `/usr/src/rpm/BUILD/postgresql-slony1-engine-1.2.9/src/backend'
make[3]: Entering directory `/usr/src/rpm/BUILD/postgresql-slony1-engine-1.2.9/src/ducttape'
make[3]: Leaving directory `/usr/src/rpm/BUILD/postgresql-slony1-engine-1.2.9/src/ducttape'
make[2]: Leaving directory `/usr/src/rpm/BUILD/postgresql-slony1-engine-1.2.9/src'
make[2]: Entering directory `/usr/src/rpm/BUILD/postgresql-slony1-engine-1.2.9/tools'
for subdir in altperl ; do \
          make -C $subdir all || exit; \
        done
make[3]: Entering directory `/usr/src/rpm/BUILD/postgresql-slony1-engine-1.2.9/tools/altperl'
make[3]: Leaving directory `/usr/src/rpm/BUILD/postgresql-slony1-engine-1.2.9/tools/altperl'
make[2]: Leaving directory `/usr/src/rpm/BUILD/postgresql-slony1-engine-1.2.9/tools'
make[2]: Entering directory `/usr/src/rpm/BUILD/postgresql-slony1-engine-1.2.9/doc'
make[3]: Entering directory `/usr/src/rpm/BUILD/postgresql-slony1-engine-1.2.9/doc/concept'
unable to create Slon.eps from Slon_900x720.jpg
groff -U -t -p -ms -mpspic Slony-I-concept.nr >Slony-I-concept.ps 2>/dev/null
groff -U -t -p -ms -mpspic Slony-I-concept.nr >Slony-I-concept.ps
Slony-I-concept.nr:29: can't open `Slon.eps': No such file or directory
groff -U -t -p -ms -mpspic Slony-I-concept.nr >Slony-I-concept.ps
Slony-I-concept.nr:29: can't open `Slon.eps': No such file or directory
groff -Tlatin1 -U -t -p -ms -mpspic Slony-I-concept.nr >Slony-I-concept.txt 2>/dev/null
groff -Tlatin1 -U -t -p -ms -mpspic Slony-I-concept.nr >Slony-I-concept.txt
Slony-I-concept.nr:29: can't open `Slon.eps': No such file or directory
Slony-I-concept.nr:31: warning: can't find font `TR'
grotty:<standard input> (figure-1.pic):4157: Unknown color (gray 0.90f) mapped to default
grotty:<standard input> (figure-1.pic):4205: Unknown color (gray 0.80f) mapped to default
make[3]: Leaving directory `/usr/src/rpm/BUILD/postgresql-slony1-engine-1.2.9/doc/concept'
make[3]: Entering directory `/usr/src/rpm/BUILD/postgresql-slony1-engine-1.2.9/doc/implementation'
unable to create Slon.eps from Slon_900x720.jpg
groff -U -t -p -ms -mpspic Slony-I-implementation.nr >Slony-I-implementation.ps 2>/dev/null
groff -U -t -p -ms -mpspic Slony-I-implementation.nr >Slony-I-implementation.ps
Slony-I-implementation.nr:29: can't open `Slon.eps': No such file or directory
groff -Tlatin1 -U -t -p -ms -mpspic Slony-I-implementation.nr >Slony-I-implementation.txt 2>/dev/null
groff -Tlatin1 -U -t -p -ms -mpspic Slony-I-implementation.nr >Slony-I-implementation.txt
Slony-I-implementation.nr:29: can't open `Slon.eps': No such file or directory
Slony-I-implementation.nr:31: warning: can't find font `TR'
make[3]: Leaving directory `/usr/src/rpm/BUILD/postgresql-slony1-engine-1.2.9/doc/implementation'
make[3]: Entering directory `/usr/src/rpm/BUILD/postgresql-slony1-engine-1.2.9/doc/howto'
make[3]: Nothing to be done for `all'.
make[3]: Leaving directory `/usr/src/rpm/BUILD/postgresql-slony1-engine-1.2.9/doc/howto'
make[3]: Entering directory `/usr/src/rpm/BUILD/postgresql-slony1-engine-1.2.9/doc/adminguide'
LC_ALL=C /usr/bin/perl /usr/bin/collateindex.pl -f -g -o bookindex.sgml -N
{ \
        echo "<!entity version \"1.2.9\">"; \
        echo "<!entity majorversion \"`expr 1.2.9 : '\([0-9][0-9]*\.[0-9][0-9]*\)'`\">"; \
        } >version.sgml
openjade:slony.sgml:3:55:W: cannot generate system identifier for public text "-//OASIS//DTD DocBook V4.2//EN"
openjade:slony.sgml:54:0:E: reference to entity "BOOK" for which no system identifier could be generated
openjade:slony.sgml:3:0: entity was defined here
openjade:slony.sgml:54:0:E: DTD did not contain element declaration for document type name
openjade:slony.sgml:56:9:E: there is no attribute "ID"
openjade:slony.sgml:56:16:E: element "BOOK" undefined
openjade:slony.sgml:57:8:E: element "TITLE" undefined
openjade:slony.sgml:57:17:E: element "PRODUCTNAME" undefined
openjade:slony.sgml:58:11:E: element "BOOKINFO" undefined
openjade:slony.sgml:59:15:E: element "CORPAUTHOR" undefined
openjade:slony.sgml:60:11:E: element "AUTHOR" undefined
openjade:slony.sgml:61:16:E: element "FIRSTNAME" undefined
openjade:slony.sgml:62:14:E: element "SURNAME" undefined
openjade:legal.sgml:3:10:E: element "COPYRIGHT" undefined
openjade:legal.sgml:4:6:E: element "YEAR" undefined
openjade:legal.sgml:5:8:E: element "HOLDER" undefined
openjade:legal.sgml:8:16:E: there is no attribute "ID"
openjade:legal.sgml:8:29:E: element "LEGALNOTICE" undefined
openjade:legal.sgml:9:7:E: element "TITLE" undefined
openjade:legal.sgml:11:6:E: element "PARA" undefined
openjade:legal.sgml:12:14:E: element "PRODUCTNAME" undefined
openjade:legal.sgml:12:54:W: cannot generate system identifier for general entity "copy"
openjade:legal.sgml:12:54:E: general entity "copy" not defined and no default entity
openjade:legal.sgml:12:58:E: reference to entity "copy" for which no system identifier could be generated
openjade:legal.sgml:12:53: entity was defined here
openjade:legal.sgml:17:6:E: element "PARA" undefined
openjade:legal.sgml:25:6:E: element "PARA" undefined
openjade:legal.sgml:33:6:E: element "PARA" undefined
openjade:legal.sgml:37:34:E: element "QUOTE" undefined
openjade:legal.sgml:42:6:E: element "PARA" undefined
openjade:legal.sgml:42:28:E: element "TRADEMARK" undefined
openjade:legal.sgml:43:23:E: element "TRADEMARK" undefined
openjade:legal.sgml:45:11:E: element "TRADEMARK" undefined
openjade:legal.sgml:46:16:E: element "TRADEMARK" undefined
openjade:legal.sgml:47:11:E: element "TRADEMARK" undefined
openjade:slony.sgml:67:14:E: there is no attribute "ID"
openjade:slony.sgml:67:26:E: element "ARTICLE" undefined
openjade:slony.sgml:68:10:E: element "TITLE" undefined
openjade:slony.sgml:68:19:E: element "PRODUCTNAME" undefined
openjade:intro.sgml:2:10:E: there is no attribute "ID"
openjade:intro.sgml:2:24:E: element "SECT1" undefined
openjade:intro.sgml:3:6:E: element "TITLE" undefined
openjade:intro.sgml:3:31:E: element "PRODUCTNAME" undefined
openjade:intro.sgml:5:6:E: element "SECT2" undefined
openjade:intro.sgml:5:14:E: element "TITLE" undefined
openjade:intro.sgml:5:28:E: element "PRODUCTNAME" undefined
openjade:intro.sgml:7:5:E: element "PARA" undefined
openjade:intro.sgml:7:14:E: element "PRODUCTNAME" undefined
openjade:intro.sgml:7:26:E: element "QUOTE" undefined
openjade:intro.sgml:9:39:E: element "PRODUCTNAME" undefined
openjade:intro.sgml:12:6:E: element "QUOTE" undefined
openjade:intro.sgml:17:5:E: element "PARA" undefined
openjade:intro.sgml:17:30:E: there is no attribute "LINKEND"
openjade:intro.sgml:17:50:E: element "XREF" undefined
openjade:intro.sgml:20:5:E: element "PARA" undefined
openjade:intro.sgml:20:15:E: element "PRODUCTNAME" undefined
openjade:intro.sgml:24:59:E: element "PRODUCTNAME" undefined
openjade:intro.sgml:27:5:E: element "PARA" undefined
openjade:intro.sgml:27:45:E: element "PRODUCTNAME" undefined
openjade:intro.sgml:30:13:E: element "ITEMIZEDLIST" undefined
openjade:intro.sgml:31:9:E: element "LISTITEM" undefined
openjade:intro.sgml:31:15:E: element "PARA" undefined
openjade:intro.sgml:31:58:E: element "QUOTE" undefined
openjade:intro.sgml:33:9:E: element "LISTITEM" undefined
openjade:intro.sgml:33:15:E: element "PARA" undefined
openjade:intro.sgml:35:9:E: element "LISTITEM" undefined
openjade:intro.sgml:35:15:E: element "PARA" undefined
openjade:intro.sgml:38:9:E: element "LISTITEM" undefined
openjade:intro.sgml:38:15:E: element "PARA" undefined
openjade:intro.sgml:41:9:E: element "LISTITEM" undefined
openjade:intro.sgml:41:15:E: element "PARA" undefined
openjade:intro.sgml:41:25:E: element "QUOTE" undefined
openjade:intro.sgml:43:22:E: element "PRODUCTNAME" undefined
openjade:intro.sgml:47:5:E: element "PARA" undefined
openjade:intro.sgml:47:37:E: there is no attribute "LINKEND"
openjade:intro.sgml:47:50:E: element "LINK" undefined
openjade:intro.sgml:51:34:E: element "QUOTE" undefined
openjade:intro.sgml:51:63:E: element "QUOTE" undefined
openjade:intro.sgml:53:16:E: element "PRODUCTNAME" undefined
openjade:intro.sgml:55:5:E: element "PARA" undefined
openjade:intro.sgml:55:19:E: element "PRODUCTNAME" undefined
openjade:intro.sgml:56:30:E: element "EMPHASIS" undefined
openjade:intro.sgml:58:6:E: element "QUOTE" undefined
openjade:intro.sgml:59:59:E: element "PRODUCTNAME" undefined
openjade:intro.sgml:60:10:E: element "TRADEMARK" undefined
openjade:intro.sgml:61:6:E: element "QUOTE" undefined
openjade:intro.sgml:64:5:E: element "PARA" undefined
openjade:intro.sgml:65:28:E: element "EMPHASIS" undefined
openjade:intro.sgml:66:23:E: element "PRODUCTNAME" undefined
openjade:intro.sgml:70:6:E: element "SECT2" undefined
openjade:intro.sgml:70:13:E: element "TITLE" undefined
openjade:intro.sgml:72:5:E: element "PARA" undefined
openjade:intro.sgml:72:14:E: element "PRODUCTNAME" undefined
openjade:intro.sgml:73:53:E: element "PRODUCTNAME" undefined
openjade:intro.sgml:79:6:E: element "SECT2" undefined
openjade:intro.sgml:79:13:E: element "TITLE" undefined
openjade:intro.sgml:79:28:E: element "PRODUCTNAME" undefined
openjade:intro.sgml:81:13:E: element "ITEMIZEDLIST" undefined
openjade:intro.sgml:82:9:E: element "LISTITEM" undefined
openjade:intro.sgml:82:15:E: element "PARA" undefined
openjade:intro.sgml:82:24:E: element "PRODUCTNAME" undefined
openjade:intro.sgml:84:9:E: element "LISTITEM" undefined
openjade:intro.sgml:84:15:E: element "PARA" undefined
openjade:intro.sgml:84:25:E: element "PRODUCTNAME" undefined
openjade:intro.sgml:88:5:E: element "PARA" undefined
openjade:intro.sgml:89:67:E: element "EMPHASIS" undefined
openjade:intro.sgml:91:6:E: element "QUOTE" undefined
openjade:intro.sgml:91:55:E: element "QUOTE" undefined
openjade:intro.sgml:93:24:E: element "PRODUCTNAME" undefined
openjade:intro.sgml:96:9:E: element "LISTITEM" undefined
openjade:intro.sgml:96:15:E: element "PARA" undefined
openjade:intro.sgml:96:24:E: element "PRODUCTNAME" undefined
openjade:intro.sgml:102:5:E: element "PARA" undefined
openjade:intro.sgml:104:20:E: element "PRODUCTNAME" undefined
openjade:intro.sgml:105:6:E: element "QUOTE" undefined
openjade:intro.sgml:107:21:E: element "PRODUCTNAME" undefined
openjade:intro.sgml:107:52:E: element "PRODUCTNAME" undefined
openjade:intro.sgml:110:6:E: element "SECT2" undefined
openjade:intro.sgml:110:13:E: element "TITLE" undefined
openjade:intro.sgml:110:35:E: element "PRODUCTNAME" undefined
openjade:intro.sgml:113:5:E: element "PARA" undefined
openjade:intro.sgml:113:43:E: element "QUOTE" undefined
openjade:intro.sgml:114:63:E: element "PRODUCTNAME" undefined
openjade:intro.sgml:119:10:E: element "QUOTE" undefined
openjade:intro.sgml:122:16:E: element "PRODUCTNAME" undefined
openjade:intro.sgml:124:5:E: element "PARA" undefined
openjade:intro.sgml:125:6:E: element "QUOTE" undefined
openjade:intro.sgml:127:22:E: element "LINK" undefined
openjade:intro.sgml:127:31:E: element "COMMAND" undefined
openjade:intro.sgml:128:39:E: element "PRODUCTNAME" undefined
openjade:intro.sgml:130:8:E: element "PRODUCTNAME" undefined
openjade:intro.sgml:132:5:E: element "PARA" undefined
openjade:intro.sgml:132:31:E: element "PRODUCTNAME" undefined
openjade:intro.sgml:135:6:E: element "SECT2" undefined
openjade:intro.sgml:135:13:E: element "TITLE" undefined
openjade:intro.sgml:137:10:E: element "INDEXTERM" undefined
openjade:intro.sgml:137:19:E: element "PRIMARY" undefined
openjade:intro.sgml:137:43:E: element "PRODUCTNAME" undefined
openjade:intro.sgml:139:5:E: element "PARA" undefined
openjade:intro.sgml:139:14:E: element "PRODUCTNAME" undefined
openjade:intro.sgml:141:64:E: element "PRODUCTNAME" undefined
openjade:intro.sgml:143:31:E: element "COMMAND" undefined
openjade:intro.sgml:144:44:E: element "PRODUCTNAME" undefined
openjade:intro.sgml:146:8:E: element "PRODUCTNAME" undefined
openjade:intro.sgml:148:5:E: element "PARA" undefined
openjade:intro.sgml:148:35:E: element "EMPHASIS" undefined
openjade:intro.sgml:149:25:E: element "EMPHASIS" undefined
openjade:intro.sgml:150:13:E: element "QUOTE" undefined
openjade:intro.sgml:152:29:E: element "XREF" undefined
openjade:intro.sgml:154:29:E: element "XREF" undefined
openjade:intro.sgml:155:44:E: element "XREF" undefined
openjade:intro.sgml:157:9:E: element "EMPHASIS" undefined
openjade:intro.sgml:158:9:E: element "EMPHASIS" undefined
openjade:intro.sgml:161:6:E: element "QUOTE" undefined
openjade:intro.sgml:162:36:E: element "APPLICATION" undefined
openjade:intro.sgml:165:5:E: element "PARA" undefined
openjade:intro.sgml:165:40:E: element "PRODUCTNAME" undefined
openjade:intro.sgml:167:28:E: element "APPLICATION" undefined
openjade:intro.sgml:168:23:E: element "XREF" undefined
openjade:intro.sgml:169:6:E: element "QUOTE" undefined
openjade:intro.sgml:171:23:E: element "XREF" undefined
openjade:intro.sgml:172:20:E: element "LINK" undefined
openjade:intro.sgml:174:5:E: element "PARA" undefined
openjade:intro.sgml:175:31:E: element "PRODUCTNAME" undefined
openjade:intro.sgml:175:44:E: element "ACRONYM" undefined
openjade:intro.sgml:176:30:E: element "ACRONYM" undefined
openjade:intro.sgml:179:13:E: element "ITEMIZEDLIST" undefined
openjade:intro.sgml:181:9:E: element "LISTITEM" undefined
openjade:intro.sgml:181:15:E: element "PARA" undefined
openjade:intro.sgml:181:42:E: element "EMPHASIS" undefined
openjade:intro.sgml:182:9:E: element "EMPHASIS" undefined
openjade:intro.sgml:185:9:E: element "LISTITEM" undefined
openjade:intro.sgml:185:15:E: element "PARA" undefined
openjade:intro.sgml:187:51:E: element "QUOTE" undefined
openjade:intro.sgml:189:6:E: element "QUOTE" undefined
openjade:intro.sgml:194:6:E: element "SECT2" undefined
openjade:intro.sgml:194:13:E: element "TITLE" undefined
openjade:intro.sgml:196:10:E: element "INDEXTERM" undefined
openjade:intro.sgml:196:19:E: element "PRIMARY" undefined
openjade:intro.sgml:198:5:E: element "PARA" undefined
openjade:intro.sgml:202:5:E: element "PARA" undefined
openjade:intro.sgml:202:15:E: element "PRODUCTNAME" undefined
openjade:intro.sgml:204:21:E: element "QUOTE" undefined
openjade:intro.sgml:205:6:E: element "QUOTE" undefined
openjade:intro.sgml:207:5:E: element "PARA" undefined
openjade:intro.sgml:208:9:E: element "EMPHASIS" undefined
openjade:intro.sgml:209:32:E: element "PRODUCTNAME" undefined
openjade:intro.sgml:210:42:E: element "EMPHASIS" undefined
openjade:intro.sgml:213:13:E: element "ITEMIZEDLIST" undefined
openjade:intro.sgml:214:9:E: element "LISTITEM" undefined
openjade:intro.sgml:214:15:E: element "PARA" undefined
openjade:intro.sgml:216:5:E: element "PARA" undefined
openjade:intro.sgml:223:5:E: element "PARA" undefined
openjade:intro.sgml:227:9:E: element "LISTITEM" undefined
openjade:intro.sgml:227:15:E: element "PARA" undefined
openjade:intro.sgml:229:5:E: element "PARA" undefined
openjade:intro.sgml:230:12:E: element "PRODUCTNAME" undefined
openjade:intro.sgml:231:18:E: element "QUOTE" undefined
openjade:intro.sgml:233:8:E: element "COMMAND" undefined
openjade:intro.sgml:235:5:E: element "PARA" undefined
openjade:intro.sgml:239:9:E: element "LISTITEM" undefined
openjade:intro.sgml:239:15:E: element "PARA" undefined
openjade:intro.sgml:242:5:E: element "PARA" undefined
openjade:intro.sgml:243:16:E: element "PRODUCTNAME" undefined
openjade:I: maximum number of errors (200) reached; change with -E option
openjade:/usr/share/sgml/docbook/dsssl-stylesheets/html/../common/../common/dbl1bg.dsl:2:69:W: cannot generate system identifier for public text "ISO 8879:1986//ENTITIES Russian Cyrillic//EN"
openjade:/usr/share/sgml/docbook/dsssl-stylesheets/html/../common/../common/dbl1bg.dsl:3:5:E: reference to entity "cyr1" for which no system identifier could be generated
openjade:/usr/share/sgml/docbook/dsssl-stylesheets/html/../common/../common/dbl1bg.dsl:2:0: entity was defined here
openjade:/usr/share/sgml/docbook/dsssl-stylesheets/html/../common/../common/dbl1no.dsl:2:66:W: cannot generate system identifier for public text "ISO 8879:1986//ENTITIES Added Latin 1//EN"
openjade:/usr/share/sgml/docbook/dsssl-stylesheets/html/../common/../common/dbl1no.dsl:3:5:E: reference to entity "lat1" for which no system identifier could be generated
openjade:/usr/share/sgml/docbook/dsssl-stylesheets/html/../common/../common/dbl1no.dsl:2:0: entity was defined here
openjade:/usr/share/sgml/docbook/dsssl-stylesheets/html/../common/../common/dbl1ro.dsl:2:66:W: cannot generate system identifier for public text "ISO 8879:1986//ENTITIES Added Latin 1//EN"
openjade:/usr/share/sgml/docbook/dsssl-stylesheets/html/../common/../common/dbl1ro.dsl:3:5:E: reference to entity "lat1" for which no system identifier could be generated
openjade:/usr/share/sgml/docbook/dsssl-stylesheets/html/../common/../common/dbl1ro.dsl:2:0: entity was defined here
openjade:/usr/share/sgml/docbook/dsssl-stylesheets/html/../common/../common/dbl1ro.dsl:4:66:W: cannot generate system identifier for public text "ISO 8879:1986//ENTITIES Added Latin 2//EN"
openjade:/usr/share/sgml/docbook/dsssl-stylesheets/html/../common/../common/dbl1ro.dsl:5:5:E: reference to entity "lat2" for which no system identifier could be generated
openjade:/usr/share/sgml/docbook/dsssl-stylesheets/html/../common/../common/dbl1ro.dsl:4:0: entity was defined here
openjade:/usr/share/sgml/docbook/dsssl-stylesheets/html/../common/../common/dbl1ru.dsl:2:69:W: cannot generate system identifier for public text "ISO 8879:1986//ENTITIES Russian Cyrillic//EN"
openjade:/usr/share/sgml/docbook/dsssl-stylesheets/html/../common/../common/dbl1ru.dsl:3:5:E: reference to entity "cyr1" for which no system identifier could be generated
openjade:/usr/share/sgml/docbook/dsssl-stylesheets/html/../common/../common/dbl1ru.dsl:2:0: entity was defined here
openjade:/usr/share/sgml/docbook/dsssl-stylesheets/html/../common/../common/dbl1sl.dsl:2:66:W: cannot generate system identifier for public text "ISO 8879:1986//ENTITIES Added Latin 2//EN"
openjade:/usr/share/sgml/docbook/dsssl-stylesheets/html/../common/../common/dbl1sl.dsl:3:5:E: reference to entity "lat2" for which no system identifier could be generated
openjade:/usr/share/sgml/docbook/dsssl-stylesheets/html/../common/../common/dbl1sl.dsl:2:0: entity was defined here
openjade:/usr/share/sgml/docbook/dsssl-stylesheets/html/../common/../common/dbl1sr.dsl:2:66:W: cannot generate system identifier for public text "ISO 8879:1986//ENTITIES Added Latin 2//EN"
openjade:/usr/share/sgml/docbook/dsssl-stylesheets/html/../common/../common/dbl1sr.dsl:3:5:E: reference to entity "lat2" for which no system identifier could be generated
openjade:/usr/share/sgml/docbook/dsssl-stylesheets/html/../common/../common/dbl1sr.dsl:2:0: entity was defined here
openjade:/usr/share/sgml/docbook/dsssl-stylesheets/html/dblink.dsl:203:1:E: XRef LinkEnd to missing ID 'slonylistenercosts'
openjade:/usr/share/sgml/docbook/dsssl-stylesheets/html/dblink.dsl:203:1:E: XRef LinkEnd to missing ID 'function.logtrigger'
openjade:/usr/share/sgml/docbook/dsssl-stylesheets/html/dblink.dsl:203:1:E: XRef LinkEnd to missing ID 'function.denyaccess'
openjade:/usr/share/sgml/docbook/dsssl-stylesheets/html/dblink.dsl:203:1:E: XRef LinkEnd to missing ID 'slon'
openjade:/usr/share/sgml/docbook/dsssl-stylesheets/html/dblink.dsl:203:1:E: XRef LinkEnd to missing ID 'stmtddlscript'
openjade:/usr/share/sgml/docbook/dsssl-stylesheets/html/dblink.dsl:203:1:E: XRef LinkEnd to missing ID 'stmtddlscript'
make[3]: *** [html] Error 1
make[3]: Leaving directory `/usr/src/rpm/BUILD/postgresql-slony1-engine-1.2.9/doc/adminguide'
make[2]: *** [all] Error 2
make[2]: Leaving directory `/usr/src/rpm/BUILD/postgresql-slony1-engine-1.2.9/doc'
make[1]: *** [all] Error 2
make[1]: Leaving directory `/usr/src/rpm/BUILD/postgresql-slony1-engine-1.2.9'
error: Bad exit status from /var/tmp/rpm-tmp.97158 (%build)


RPM build errors:
    Bad exit status from /var/tmp/rpm-tmp.97158 (%build)
make: *** [rpm] Error 1
[root@corona slony1-1.2.9]#