localname:/usr/src/asterisk-addons-1.2.2/res_sqlite3# make
ASTSRC=/usr/src/asterisk-1.2.5 /usr/src/asterisk-1.2.5/contrib/scripts/astxs "-append=CFLAGS:-Isqlite-3.2.1 -I sqlite-3.2.1/src" "-append=EXTOBJ:./sqlite-3.2.1/.libs/libsqlite3.a" res_sqlite.c
/bin/sh: line 1: curl-config: command not found
gcc -I/usr/src/asterisk-1.2.5 -I/usr/src/asterisk-1.2.5/include -pipe -Wall -Wstrict-prototypes -Wmissing-prototypes -Wmissing-declarations -g3 -Iinclude -I../include -D_REENTRANT -D_GNU_SOURCE -O6 -march=i686 -DZAPTEL_OPTIMIZATIONS -fomit-frame-pointer -fPIC -Isqlite-3.2.1 -I sqlite-3.2.1/src -c res_sqlite.c -o res_sqlite.o
In file included from res_sqlite.c:14:
/usr/src/asterisk-1.2.5/include/asterisk/file.h:27:2: #error You must include stdio.h before file.h!
In file included from res_sqlite.c:14:
/usr/src/asterisk-1.2.5/include/asterisk/file.h:56: error: syntax error before '*' token
/usr/src/asterisk-1.2.5/include/asterisk/file.h:56: warning: function declaration isn't a prototype
/usr/src/asterisk-1.2.5/include/asterisk/file.h:57: error: syntax error before '*' token
/usr/src/asterisk-1.2.5/include/asterisk/file.h:57: warning: function declaration isn't a prototype
In file included from res_sqlite.c:28:
sqlite-3.2.1/sqlite3.h:1242: warning: function declaration isn't a prototype
In file included from res_sqlite.c:29:
sqlite-3.2.1/src/sqliteInt.h:1559: warning: function declaration isn't a prototype
res_sqlite.c: In function `sqlite_log':
res_sqlite.c:967: warning: int format, long int arg (arg 18)
res_sqlite.c:967: warning: int format, long int arg (arg 19)
res_sqlite.c:967: warning: int format, long int arg (arg 20)
res_sqlite.c:967: warning: int format, long int arg (arg 21)
make: *** [res_sqlite.so] Error 255
localname:/usr/src/asterisk-addons-1.2.2/res_sqlite3#