All pastes #45788 Raw Edit

Stuff

public text v1 · immutable
#45788 ·published 2006-03-15 05:00 UTC
rendered paste body
fno-common -DQT_CLEAN_NAMESPACE -DQT_NO_ASCII_CAST -DQT_NO_STL -DQT_NO_COMPAT -DQT_NO_TRANSLATION    -o libplugin.la   plugin.lo pluginconfig.moc.lo
make[4]: Leaving directory `/var/tmp/portage/amarok-1.3.6/work/amarok-1.3.6/amarok/src/plugin'
Making all in engine
make[4]: Entering directory `/var/tmp/portage/amarok-1.3.6/work/amarok-1.3.6/amarok/src/engine'
Making all in .
make[5]: Entering directory `/var/tmp/portage/amarok-1.3.6/work/amarok-1.3.6/amarok/src/engine'
/usr/qt/3/bin/moc ./enginebase.h -o enginebase.moc
/bin/sh ../../../libtool --silent --tag=CXX --mode=compile x86_64-pc-linux-gnu-g++ -DHAVE_CONFIG_H -I. -I. -I../../.. -I../../../amarok/src/plugin -I../../../amarok/src -I/usr/kde/3.4/include -I/usr/qt/3/include -I.   -DQT_THREAD_SUPPORT  -D_REENTRANT  -Wno-long-long -Wundef -ansi -D_XOPEN_SOURCE=500 -D_BSD_SOURCE -Wcast-align -Wconversion -Wchar-subscripts -Wall -W -Wpointer-arith -DNDEBUG -DNO_DEBUG -O2 -march=k8 -Os -pipe -Wformat-security -Wmissing-format-attribute -Wno-non-virtual-dtor -fno-exceptions -fno-check-new -fno-common -DQT_CLEAN_NAMESPACE -DQT_NO_ASCII_CAST -DQT_NO_STL -DQT_NO_COMPAT -DQT_NO_TRANSLATION  -c -o enginebase.lo enginebase.cpp
/bin/sh ../../../libtool --silent --tag=CXX --mode=link x86_64-pc-linux-gnu-g++  -Wno-long-long -Wundef -ansi -D_XOPEN_SOURCE=500 -D_BSD_SOURCE -Wcast-align -Wconversion -Wchar-subscripts -Wall -W -Wpointer-arith -DNDEBUG -DNO_DEBUG -O2 -march=k8 -Os -pipe -Wformat-security -Wmissing-format-attribute -Wno-non-virtual-dtor -fno-exceptions -fno-check-new -fno-common -DQT_CLEAN_NAMESPACE -DQT_NO_ASCII_CAST -DQT_NO_STL -DQT_NO_COMPAT -DQT_NO_TRANSLATION    -o libengine.la   enginebase.lo
make[5]: Leaving directory `/var/tmp/portage/amarok-1.3.6/work/amarok-1.3.6/amarok/src/engine'
Making all in void
make[5]: Entering directory `/var/tmp/portage/amarok-1.3.6/work/amarok-1.3.6/amarok/src/engine/void'
/bin/sh ../../../../libtool --silent --tag=CXX --mode=compile x86_64-pc-linux-gnu-g++ -DHAVE_CONFIG_H -I. -I. -I../../../.. -I../../../../amarok/src/engine -I../../../../amarok/src/plugin -I../../../../amarok/src -I/usr/kde/3.4/include -I/usr/qt/3/include -I.   -DQT_THREAD_SUPPORT  -D_REENTRANT  -Wno-long-long -Wundef -ansi -D_XOPEN_SOURCE=500 -D_BSD_SOURCE -Wcast-align -Wconversion -Wchar-subscripts -Wall -W -Wpointer-arith -DNDEBUG -DNO_DEBUG -O2 -march=k8 -Os -pipe -Wformat-security -Wmissing-format-attribute -Wno-non-virtual-dtor -fno-exceptions -fno-check-new -fno-common -DQT_CLEAN_NAMESPACE -DQT_NO_ASCII_CAST -DQT_NO_STL -DQT_NO_COMPAT -DQT_NO_TRANSLATION  -c -o void-engine.lo void-engine.cpp
/bin/sh ../../../../libtool --silent --tag=CXX --mode=link x86_64-pc-linux-gnu-g++  -Wno-long-long -Wundef -ansi -D_XOPEN_SOURCE=500 -D_BSD_SOURCE -Wcast-align -Wconversion -Wchar-subscripts -Wall -W -Wpointer-arith -DNDEBUG -DNO_DEBUG -O2 -march=k8 -Os -pipe -Wformat-security -Wmissing-format-attribute -Wno-non-virtual-dtor -fno-exceptions -fno-check-new -fno-common -DQT_CLEAN_NAMESPACE -DQT_NO_ASCII_CAST -DQT_NO_STL -DQT_NO_COMPAT -DQT_NO_TRANSLATION    -o libamarok_void-engine_plugin.la -rpath /usr/kde/3.4/lib64/kde3 -avoid-version -module -no-undefined -Wl,--no-undefined -Wl,--allow-shlib-undefined -R /usr/kde/3.4/lib64 -R /usr/kde/3.4/lib64 -R /usr/qt/3/lib64 -R /usr/lib64  -L/usr/kde/3.4/lib64 -L/usr/qt/3/lib64 -L/usr/lib64    void-engine.lo ../../../../amarok/src/engine/libengine.la ../../../../amarok/src/plugin/libplugin.la -lkdecore
grep: /usr/lib64/libICE.la: No such file or directory
/bin/sed: can't read /usr/lib64/libICE.la: No such file or directory
libtool: link: `/usr/lib64/libICE.la' is not a valid libtool archive
make[5]: *** [libamarok_void-engine_plugin.la] Error 1
make[5]: Leaving directory `/var/tmp/portage/amarok-1.3.6/work/amarok-1.3.6/amarok/src/engine/void'
make[4]: *** [all-recursive] Error 1
make[4]: Leaving directory `/var/tmp/portage/amarok-1.3.6/work/amarok-1.3.6/amarok/src/engine'
make[3]: *** [all-recursive] Error 1
make[3]: Leaving directory `/var/tmp/portage/amarok-1.3.6/work/amarok-1.3.6/amarok/src'
make[2]: *** [all-recursive] Error 1
make[2]: Leaving directory `/var/tmp/portage/amarok-1.3.6/work/amarok-1.3.6/amarok'
make[1]: *** [all-recursive] Error 1
make[1]: Leaving directory `/var/tmp/portage/amarok-1.3.6/work/amarok-1.3.6'
make: *** [all] Error 2

!!! ERROR: media-sound/amarok-1.3.6 failed.
Call stack:
  ebuild.sh, line 1557:   Called dyn_compile
  ebuild.sh, line 966:   Called src_compile
  amarok-1.3.6.ebuild, line 79:   Called kde_src_compile
  kde.eclass, line 111:   Called kde_src_compile 'all'
  kde.eclass, line 228:   Called kde_src_compile 'myconf' 'configure' 'make'

!!! died running emake, kde_src_compile:make
!!! If you need support, post the topmost build error, and the call stack if relevant.

slacker ~ #