All pastes #457817 Raw Edit

varadhan

public text v1 · immutable
#457817 ·published 2007-04-25 15:58 UTC
rendered paste body
make[3]: Leaving directory `/home/build-head/svn/gnome2/evolution/evolution-2.11.1.1/_build/help'
xmllint --noout --noent --path C:../../help/C --xinclude --postvalid ../../help/C/evolution.xml
../../help/C/evolution.xml:3454: element link: validity error : Element br is not declared in link list of possible children
../../help/C/evolution.xml:3454: element br: validity error : No declaration for element br
Document ../../help/C/evolution.xml does not validate
xmllint --noout --noent --path en_GB:../../help/en_GB --xinclude --postvalid ../../help/en_GB/evolution.xml
../../help/en_GB/evolution.xml:3441: element link: validity error : Element br is not declared in link list of possible children
../../help/en_GB/evolution.xml:3441: element br: validity error : No declaration for element br
Document ../../help/en_GB/evolution.xml does not validate
xmllint --noout --noent --path es:../../help/es --xinclude --postvalid ../../help/es/evolution.xml
../../help/es/evolution.xml:3368: element para: validity error : Element para is not declared in para list of possible children
../../help/es/evolution.xml:3443: element link: validity error : Element br is not declared in link list of possible children../../help/es/evolution.xml:3443: element br: validity error : No declaration for element br
Document ../../help/es/evolution.xml does not validate
xmllint --noout --noent --path sv:../../help/sv --xinclude --postvalid ../../help/sv/evolution.xml
../../help/sv/evolution.xml:3441: element link: validity error : Element br is not declared in link list of possible children../../help/sv/evolution.xml:3441: element br: validity error : No declaration for element br
Document ../../help/sv/evolution.xml does not validate
make[2]: *** [check-doc-docs] Error 3
make[2]: Leaving directory `/home/build-head/svn/gnome2/evolution/evolution-2.11.1.1/_build/help'
make[1]: *** [check-recursive] Error 1
make[1]: Leaving directory `/home/build-head/svn/gnome2/evolution/evolution-2.11.1.1/_build'
make: *** [distcheck] Error 2