------ Rebuild All started: Project: prog5, Configuration: Debug Win32 ------
Deleting intermediate and output files for project 'prog5', configuration 'Debug|Win32'
Compiling...
prog5.cpp
d:\homework-\current\cmpsc.101.progmn\programs\prog5\prog5\prog5\prog5.cpp(85) : error C2146: syntax error : missing ';' before identifier 'Pizzeria'
d:\homework-\current\cmpsc.101.progmn\programs\prog5\prog5\prog5\prog5.cpp(85) : error C2146: syntax error : missing ';' before identifier 'Tonys'
d:\homework-\current\cmpsc.101.progmn\programs\prog5\prog5\prog5\prog5.cpp(85) : error C2275: 'Pizzeria' : illegal use of this type as an expression
d:\homework-\current\cmpsc.101.progmn\programs\prog5\prog5\prog5\prog5.cpp(66) : see declaration of 'Pizzeria'
d:\homework-\current\cmpsc.101.progmn\programs\prog5\prog5\prog5\prog5.cpp(85) : error C2065: 'Tonys' : undeclared identifier
d:\homework-\current\cmpsc.101.progmn\programs\prog5\prog5\prog5\prog5.cpp(90) : error C2228: left of '.OpenPizzeria' must have class/struct/union
type is ''unknown-type''
d:\homework-\current\cmpsc.101.progmn\programs\prog5\prog5\prog5\prog5.cpp(184) : warning C4482: nonstandard extension used: enum 'SizeType' used in qualified name
d:\homework-\current\cmpsc.101.progmn\programs\prog5\prog5\prog5\prog5.cpp(187) : warning C4482: nonstandard extension used: enum 'SizeType' used in qualified name
d:\homework-\current\cmpsc.101.progmn\programs\prog5\prog5\prog5\prog5.cpp(190) : warning C4482: nonstandard extension used: enum 'SizeType' used in qualified name
d:\homework-\current\cmpsc.101.progmn\programs\prog5\prog5\prog5\prog5.cpp(193) : warning C4482: nonstandard extension used: enum 'SizeType' used in qualified name
d:\homework-\current\cmpsc.101.progmn\programs\prog5\prog5\prog5\prog5.cpp(205) : warning C4482: nonstandard extension used: enum 'CrustType' used in qualified name
d:\homework-\current\cmpsc.101.progmn\programs\prog5\prog5\prog5\prog5.cpp(208) : warning C4482: nonstandard extension used: enum 'CrustType' used in qualified name
d:\homework-\current\cmpsc.101.progmn\programs\prog5\prog5\prog5\prog5.cpp(211) : warning C4482: nonstandard extension used: enum 'CrustType' used in qualified name
Build log was saved at "file://d:\HOMEWORK-\current\cmpsc.101.progmn\programs\prog5\prog5\prog5\Debug\BuildLog.htm"
prog5 - 5 error(s), 7 warning(s)
========== Rebuild All: 0 succeeded, 1 failed, 0 skipped ==========