All pastes #457055 Raw Edit

Miscellany

public text v1 · immutable
#457055 ·published 2007-04-25 04:38 UTC
rendered paste body
------ Rebuild All started: Project: prog5, Configuration: Debug Win32 ------
Deleting intermediate and output files for project 'prog5', configuration 'Debug|Win32'
Compiling...
prog5.cpp
d:\homework-\current\cmpsc.101.progmn\programs\prog5\prog5\prog5\prog5.cpp(85) : error C2146: syntax error : missing ')' before identifier 'Pizzeria'
d:\homework-\current\cmpsc.101.progmn\programs\prog5\prog5\prog5\prog5.cpp(85) : error C2664: 'void std::basic_ofstream<_Elem,_Traits>::open(const wchar_t *,std::ios_base::openmode,int)' : cannot convert parameter 1 from 'const std::_Iosb<_Dummy>::_Openmode' to 'const wchar_t *'
        with
        [
            _Elem=char,
            _Traits=std::char_traits<char>
        ]
        and
        [
            _Dummy=int
        ]
        Conversion from integral type to pointer type requires reinterpret_cast, C-style cast or function-style cast
d:\homework-\current\cmpsc.101.progmn\programs\prog5\prog5\prog5\prog5.cpp(90) : error C2065: 'Tonys' : undeclared identifier
d:\homework-\current\cmpsc.101.progmn\programs\prog5\prog5\prog5\prog5.cpp(90) : error C2228: left of '.OpenPizzeria' must have class/struct/union
        type is ''unknown-type''
d:\homework-\current\cmpsc.101.progmn\programs\prog5\prog5\prog5\prog5.cpp(96) : error C2065: 'PizzaTotals' : undeclared identifier
d:\homework-\current\cmpsc.101.progmn\programs\prog5\prog5\prog5\prog5.cpp(96) : error C2228: left of '.open' must have class/struct/union
        type is ''unknown-type''
d:\homework-\current\cmpsc.101.progmn\programs\prog5\prog5\prog5\prog5.cpp(97) : error C2143: syntax error : missing ';' before '{'
d:\homework-\current\cmpsc.101.progmn\programs\prog5\prog5\prog5\prog5.cpp(98) : error C2065: 'Price' : undeclared identifier
d:\homework-\current\cmpsc.101.progmn\programs\prog5\prog5\prog5\prog5.cpp(98) : error C2143: syntax error : missing ';' before 'string'
d:\homework-\current\cmpsc.101.progmn\programs\prog5\prog5\prog5\prog5.cpp(100) : error C2143: syntax error : missing ';' before 'string'
d:\homework-\current\cmpsc.101.progmn\programs\prog5\prog5\prog5\prog5.cpp(108) : error C2601: 'Pizzeria::OpenPizzeria' : local function definitions are illegal
        d:\homework-\current\cmpsc.101.progmn\programs\prog5\prog5\prog5\prog5.cpp(78): this line contains a '{' which has not yet been matched
d:\homework-\current\cmpsc.101.progmn\programs\prog5\prog5\prog5\prog5.cpp(154) : error C2601: 'Order::PlaceOrder' : local function definitions are illegal
        d:\homework-\current\cmpsc.101.progmn\programs\prog5\prog5\prog5\prog5.cpp(78): this line contains a '{' which has not yet been matched
d:\homework-\current\cmpsc.101.progmn\programs\prog5\prog5\prog5\prog5.cpp(248) : error C2143: syntax error : missing ';' before '{'
d:\homework-\current\cmpsc.101.progmn\programs\prog5\prog5\prog5\prog5.cpp(249) : error C2065: 'size' : undeclared identifier
d:\homework-\current\cmpsc.101.progmn\programs\prog5\prog5\prog5\prog5.cpp(250) : error C2065: 'crust' : undeclared identifier
d:\homework-\current\cmpsc.101.progmn\programs\prog5\prog5\prog5\prog5.cpp(251) : error C2065: 'N_Ingredients' : undeclared identifier
d:\homework-\current\cmpsc.101.progmn\programs\prog5\prog5\prog5\prog5.cpp(255) : error C2601: 'PizzaType::getSize' : local function definitions are illegal
        d:\homework-\current\cmpsc.101.progmn\programs\prog5\prog5\prog5\prog5.cpp(78): this line contains a '{' which has not yet been matched
d:\homework-\current\cmpsc.101.progmn\programs\prog5\prog5\prog5\prog5.cpp(260) : error C2601: 'PizzaType::getCrust' : local function definitions are illegal
        d:\homework-\current\cmpsc.101.progmn\programs\prog5\prog5\prog5\prog5.cpp(78): this line contains a '{' which has not yet been matched
d:\homework-\current\cmpsc.101.progmn\programs\prog5\prog5\prog5\prog5.cpp(265) : error C2601: 'PizzaType::howManyIngredients' : local function definitions are illegal
        d:\homework-\current\cmpsc.101.progmn\programs\prog5\prog5\prog5\prog5.cpp(78): this line contains a '{' which has not yet been matched
d:\homework-\current\cmpsc.101.progmn\programs\prog5\prog5\prog5\prog5.cpp(269) : error C2601: 'PizzaType::printIngredients' : local function definitions are illegal
        d:\homework-\current\cmpsc.101.progmn\programs\prog5\prog5\prog5\prog5.cpp(78): this line contains a '{' which has not yet been matched
d:\homework-\current\cmpsc.101.progmn\programs\prog5\prog5\prog5\prog5.cpp(277) : error C2601: 'PizzaType::getPrice' : local function definitions are illegal
        d:\homework-\current\cmpsc.101.progmn\programs\prog5\prog5\prog5\prog5.cpp(78): this line contains a '{' which has not yet been matched
d:\homework-\current\cmpsc.101.progmn\programs\prog5\prog5\prog5\prog5.cpp(299) : error C2601: 'PizzaType::getSizeAsString' : local function definitions are illegal
        d:\homework-\current\cmpsc.101.progmn\programs\prog5\prog5\prog5\prog5.cpp(78): this line contains a '{' which has not yet been matched
d:\homework-\current\cmpsc.101.progmn\programs\prog5\prog5\prog5\prog5.cpp(310) : error C2601: 'PizzaType::getCrustAsString' : local function definitions are illegal
        d:\homework-\current\cmpsc.101.progmn\programs\prog5\prog5\prog5\prog5.cpp(78): this line contains a '{' which has not yet been matched
d:\homework-\current\cmpsc.101.progmn\programs\prog5\prog5\prog5\prog5.cpp(320) : error C2601: 'PizzaType::setSize' : local function definitions are illegal
        d:\homework-\current\cmpsc.101.progmn\programs\prog5\prog5\prog5\prog5.cpp(78): this line contains a '{' which has not yet been matched
d:\homework-\current\cmpsc.101.progmn\programs\prog5\prog5\prog5\prog5.cpp(325) : error C2601: 'PizzaType::setCrust' : local function definitions are illegal
        d:\homework-\current\cmpsc.101.progmn\programs\prog5\prog5\prog5\prog5.cpp(78): this line contains a '{' which has not yet been matched
d:\homework-\current\cmpsc.101.progmn\programs\prog5\prog5\prog5\prog5.cpp(330) : error C2601: 'PizzaType::setNIngredients' : local function definitions are illegal
        d:\homework-\current\cmpsc.101.progmn\programs\prog5\prog5\prog5\prog5.cpp(78): this line contains a '{' which has not yet been matched
d:\homework-\current\cmpsc.101.progmn\programs\prog5\prog5\prog5\prog5.cpp(336) : error C2601: 'PizzaType::setIngredients' : local function definitions are illegal
        d:\homework-\current\cmpsc.101.progmn\programs\prog5\prog5\prog5\prog5.cpp(78): this line contains a '{' which has not yet been matched
d:\homework-\current\cmpsc.101.progmn\programs\prog5\prog5\prog5\prog5.cpp(354) : fatal error C1075: end of file found before the left brace '{' at 'd:\homework-\current\cmpsc.101.progmn\programs\prog5\prog5\prog5\prog5.cpp(78)' was matched
Build log was saved at "file://d:\HOMEWORK-\current\cmpsc.101.progmn\programs\prog5\prog5\prog5\Debug\BuildLog.htm"
prog5 - 28 error(s), 0 warning(s)
========== Rebuild All: 0 succeeded, 1 failed, 0 skipped ==========