/home/sam/rt61-cvs-2007042419/Module/rtmp_main.c: At top level:
/home/sam/rt61-cvs-2007042419/Module/rtmp_main.c:1051: error: expected expression before ‘__attribute__’
/home/sam/rt61-cvs-2007042419/Module/rtmp_main.c: In function ‘RT61_get_wireless_stats’:
/home/sam/rt61-cvs-2007042419/Module/rtmp_main.c:442: warning: control reaches end of non-void function
make[2]: *** [/home/sam/rt61-cvs-2007042419/Module/rtmp_main.o] Error 1
make[1]: *** [_module_/home/sam/rt61-cvs-2007042419/Module] Error 2
make[1]: Leaving directory `/usr/src/linux-2.6.20-sabayon-r3'
rt61.ko failed to build!
make: *** [module] Error 1