All pastes #455732 Raw Edit

Untitled

public text v1 · immutable
#455732 ·published 2007-04-24 12:33 UTC
rendered paste body
node1:/usr/src/linux-2.4.26# make bzImage
gcc -Wall -Wstrict-prototypes -O2 -fomit-frame-pointer -o scripts/split-include scripts/split-include.c
scripts/split-include include/linux/autoconf.h include/config
gcc -D__KERNEL__ -I/usr/src/linux-2.4.26/include -Wall -Wstrict-prototypes -Wno-trigraphs -O2 -fno-strict-aliasing -fno-common -fomit-frame-pointer -pipe -mpreferred-stack-boundary=2 -march=i686   -DKBUILD_BASENAME=main -c -o init/main.o init/main.c
In file included from /usr/src/linux-2.4.26/include/linux/kernel.h:15,
                 from /usr/src/linux-2.4.26/include/linux/wait.h:13,
                 from /usr/src/linux-2.4.26/include/linux/fs.h:12,
                 from /usr/src/linux-2.4.26/include/linux/capability.h:17,
                 from /usr/src/linux-2.4.26/include/linux/binfmts.h:5,
                 from /usr/src/linux-2.4.26/include/linux/sched.h:9,
                 from /usr/src/linux-2.4.26/include/linux/mm.h:4,
                 from /usr/src/linux-2.4.26/include/linux/slab.h:14,
                 from /usr/src/linux-2.4.26/include/linux/proc_fs.h:5,
                 from init/main.c:15:
/usr/src/linux-2.4.26/include/asm/byteorder.h:14: warning: type qualifiers ignored on function return type
/usr/src/linux-2.4.26/include/asm/byteorder.h:30: warning: type qualifiers ignored on function return type
In file included from /usr/src/linux-2.4.26/include/linux/byteorder/little_endian.h:11,
                 from /usr/src/linux-2.4.26/include/asm/byteorder.h:65,
                 from /usr/src/linux-2.4.26/include/linux/kernel.h:15,
                 from /usr/src/linux-2.4.26/include/linux/wait.h:13,
                 from /usr/src/linux-2.4.26/include/linux/fs.h:12,
                 from /usr/src/linux-2.4.26/include/linux/capability.h:17,
                 from /usr/src/linux-2.4.26/include/linux/binfmts.h:5,
                 from /usr/src/linux-2.4.26/include/linux/sched.h:9,
                 from /usr/src/linux-2.4.26/include/linux/mm.h:4,
                 from /usr/src/linux-2.4.26/include/linux/slab.h:14,
                 from /usr/src/linux-2.4.26/include/linux/proc_fs.h:5,
                 from init/main.c:15:
/usr/src/linux-2.4.26/include/linux/byteorder/swab.h:160: warning: type qualifiers ignored on function return type
/usr/src/linux-2.4.26/include/linux/byteorder/swab.h:173: warning: type qualifiers ignored on function return type
/usr/src/linux-2.4.26/include/linux/byteorder/swab.h:186: warning: type qualifiers ignored on function return type
/usr/src/linux-2.4.26/include/linux/byteorder/swab.h:200: warning: type qualifiers ignored on function return type
In file included from /usr/src/linux-2.4.26/include/linux/prefetch.h:13,
                 from /usr/src/linux-2.4.26/include/linux/list.h:6,
                 from /usr/src/linux-2.4.26/include/linux/wait.h:14,
                 from /usr/src/linux-2.4.26/include/linux/fs.h:12,
                 from /usr/src/linux-2.4.26/include/linux/capability.h:17,
                 from /usr/src/linux-2.4.26/include/linux/binfmts.h:5,
                 from /usr/src/linux-2.4.26/include/linux/sched.h:9,
                 from /usr/src/linux-2.4.26/include/linux/mm.h:4,
                 from /usr/src/linux-2.4.26/include/linux/slab.h:14,
                 from /usr/src/linux-2.4.26/include/linux/proc_fs.h:5,
                 from init/main.c:15:
/usr/src/linux-2.4.26/include/asm/processor.h:75: error: array type has incomplete element type
In file included from /usr/src/linux-2.4.26/include/linux/fs.h:323,
                 from /usr/src/linux-2.4.26/include/linux/capability.h:17,
                 from /usr/src/linux-2.4.26/include/linux/binfmts.h:5,
                 from /usr/src/linux-2.4.26/include/linux/sched.h:9,
                 from /usr/src/linux-2.4.26/include/linux/mm.h:4,
                 from /usr/src/linux-2.4.26/include/linux/slab.h:14,
                 from /usr/src/linux-2.4.26/include/linux/proc_fs.h:5,
                 from init/main.c:15:
/usr/src/linux-2.4.26/include/linux/ncp_fs_i.h:26: warning: âpackedâ attribute ignored for field of type â__u8â
/usr/src/linux-2.4.26/include/linux/ncp_fs_i.h:27: warning: âpackedâ attribute ignored for field of type â__u8[6]â
In file included from /usr/src/linux-2.4.26/include/linux/ncp_mount.h:12,
                 from /usr/src/linux-2.4.26/include/linux/ncp_fs_sb.h:12,
                 from /usr/src/linux-2.4.26/include/linux/fs.h:745,
                 from /usr/src/linux-2.4.26/include/linux/capability.h:17,
                 from /usr/src/linux-2.4.26/include/linux/binfmts.h:5,
                 from /usr/src/linux-2.4.26/include/linux/sched.h:9,
                 from /usr/src/linux-2.4.26/include/linux/mm.h:4,
                 from /usr/src/linux-2.4.26/include/linux/slab.h:14,
                 from /usr/src/linux-2.4.26/include/linux/proc_fs.h:5,
                 from init/main.c:15:
/usr/src/linux-2.4.26/include/linux/ncp.h:24: warning: âpackedâ attribute ignored for field of type â__u8â
/usr/src/linux-2.4.26/include/linux/ncp.h:25: warning: âpackedâ attribute ignored for field of type â__u8â
/usr/src/linux-2.4.26/include/linux/ncp.h:26: warning: âpackedâ attribute ignored for field of type â__u8â
/usr/src/linux-2.4.26/include/linux/ncp.h:27: warning: âpackedâ attribute ignored for field of type â__u8â
/usr/src/linux-2.4.26/include/linux/ncp.h:28: warning: âpackedâ attribute ignored for field of type â__u8â
/usr/src/linux-2.4.26/include/linux/ncp.h:29: warning: âpackedâ attribute ignored for field of type â__u8[]â
/usr/src/linux-2.4.26/include/linux/ncp.h:37: warning: âpackedâ attribute ignored for field of type â__u8â
/usr/src/linux-2.4.26/include/linux/ncp.h:38: warning: âpackedâ attribute ignored for field of type â__u8â
/usr/src/linux-2.4.26/include/linux/ncp.h:39: warning: âpackedâ attribute ignored for field of type â__u8â
/usr/src/linux-2.4.26/include/linux/ncp.h:40: warning: âpackedâ attribute ignored for field of type â__u8â
/usr/src/linux-2.4.26/include/linux/ncp.h:41: warning: âpackedâ attribute ignored for field of type â__u8â
/usr/src/linux-2.4.26/include/linux/ncp.h:42: warning: âpackedâ attribute ignored for field of type â__u8â
/usr/src/linux-2.4.26/include/linux/ncp.h:43: warning: âpackedâ attribute ignored for field of type â__u8[]â
/usr/src/linux-2.4.26/include/linux/ncp.h:137: warning: âpackedâ attribute ignored for field of type â__u8â
/usr/src/linux-2.4.26/include/linux/ncp.h:138: warning: âpackedâ attribute ignored for field of type â__u8[256]â
/usr/src/linux-2.4.26/include/linux/ncp.h:174: warning: âpackedâ attribute ignored for field of type â__u8â
In file included from /usr/src/linux-2.4.26/include/asm/smp.h:17,
                 from /usr/src/linux-2.4.26/include/linux/smp.h:14,
                 from /usr/src/linux-2.4.26/include/linux/sched.h:23,
                 from /usr/src/linux-2.4.26/include/linux/mm.h:4,
                 from /usr/src/linux-2.4.26/include/linux/slab.h:14,
                 from /usr/src/linux-2.4.26/include/linux/proc_fs.h:5,
                 from init/main.c:15:
/usr/src/linux-2.4.26/include/asm/mpspec.h:87: warning: âpackedâ attribute ignored for field of type âunsigned char[6]â
In file included from /usr/src/linux-2.4.26/include/linux/sched.h:23,
                 from /usr/src/linux-2.4.26/include/linux/mm.h:4,
                 from /usr/src/linux-2.4.26/include/linux/slab.h:14,
                 from /usr/src/linux-2.4.26/include/linux/proc_fs.h:5,
                 from init/main.c:15:
/usr/src/linux-2.4.26/include/linux/smp.h:29: error: conflicting types for âsmp_send_rescheduleâ
/usr/src/linux-2.4.26/include/asm/smp.h:42: error: previous declaration of âsmp_send_rescheduleâ was here
In file included from /usr/src/linux-2.4.26/include/hpc/hpctask.h:13,
                 from /usr/src/linux-2.4.26/include/linux/sched.h:33,
                 from /usr/src/linux-2.4.26/include/linux/mm.h:4,
                 from /usr/src/linux-2.4.26/include/linux/slab.h:14,
                 from /usr/src/linux-2.4.26/include/linux/proc_fs.h:5,
                 from init/main.c:15:
/usr/src/linux-2.4.26/include/hpc/defs.h:86: error: array type has incomplete element type
In file included from /usr/src/linux-2.4.26/include/linux/unistd.h:9,
                 from init/main.c:17:
/usr/src/linux-2.4.26/include/asm/unistd.h:375: warning: conflicting types for built-in function â_exitâ
make: *** [init/main.o] Error 1
node1:/usr/src/linux-2.4.26#