All pastes #455535 Raw Edit

Anonymous

public cpp v1 · immutable
·published 2007-04-24 07:36 UTC
rendered paste body
gcc -D__KERNEL__ -I/usr/src/linux-2.4.18-om4/include -Wall -Wstrict-prototypes -Wno-trigraphs -O2 -fomit-frame-pointer -fno-strict-aliasing -fno-common -pipe -mpreferred-stack-boundary=2 -march=i386   -DKBUILD_BASENAME=main -c -o init/main.o init/main.cIn file included from /usr/src/linux-2.4.18-om4/include/linux/prefetch.h:13,                 from /usr/src/linux-2.4.18-om4/include/linux/list.h:6,                 from /usr/src/linux-2.4.18-om4/include/linux/wait.h:14,                 from /usr/src/linux-2.4.18-om4/include/linux/fs.h:12,                 from /usr/src/linux-2.4.18-om4/include/linux/capability.h:17,                 from /usr/src/linux-2.4.18-om4/include/linux/binfmts.h:5,                 from /usr/src/linux-2.4.18-om4/include/linux/sched.h:9,                 from /usr/src/linux-2.4.18-om4/include/linux/mm.h:4,                 from /usr/src/linux-2.4.18-om4/include/linux/slab.h:14,                 from /usr/src/linux-2.4.18-om4/include/linux/proc_fs.h:5,                 from init/main.c:15:/usr/src/linux-2.4.18-om4/include/asm/processor.h:73: error: array type has incomplete element typeIn file included from /usr/src/linux-2.4.18-om4/include/linux/fs.h:206,                 from /usr/src/linux-2.4.18-om4/include/linux/capability.h:17,                 from /usr/src/linux-2.4.18-om4/include/linux/binfmts.h:5,                 from /usr/src/linux-2.4.18-om4/include/linux/sched.h:9,                 from /usr/src/linux-2.4.18-om4/include/linux/mm.h:4,                 from /usr/src/linux-2.4.18-om4/include/linux/slab.h:14,                 from /usr/src/linux-2.4.18-om4/include/linux/proc_fs.h:5,                 from init/main.c:15:/usr/src/linux-2.4.18-om4/include/asm/byteorder.h:14: warning: type qualifiers ignored on function return type/usr/src/linux-2.4.18-om4/include/asm/byteorder.h:28: warning: type qualifiers ignored on function return typeIn file included from /usr/src/linux-2.4.18-om4/include/linux/byteorder/little_endian.h:11,                 from /usr/src/linux-2.4.18-om4/include/asm/byteorder.h:45,                 from /usr/src/linux-2.4.18-om4/include/linux/fs.h:206,                 from /usr/src/linux-2.4.18-om4/include/linux/capability.h:17,                 from /usr/src/linux-2.4.18-om4/include/linux/binfmts.h:5,                 from /usr/src/linux-2.4.18-om4/include/linux/sched.h:9,                 from /usr/src/linux-2.4.18-om4/include/linux/mm.h:4,                 from /usr/src/linux-2.4.18-om4/include/linux/slab.h:14,                 from /usr/src/linux-2.4.18-om4/include/linux/proc_fs.h:5,                 from init/main.c:15:/usr/src/linux-2.4.18-om4/include/linux/byteorder/swab.h:132: warning: type qualifiers ignored on function return type/usr/src/linux-2.4.18-om4/include/linux/byteorder/swab.h:145: warning: type qualifiers ignored on function return type/usr/src/linux-2.4.18-om4/include/linux/byteorder/swab.h:159: warning: type qualifiers ignored on function return typeIn file included from /usr/src/linux-2.4.18-om4/include/linux/fs.h:319,                 from /usr/src/linux-2.4.18-om4/include/linux/capability.h:17,                 from /usr/src/linux-2.4.18-om4/include/linux/binfmts.h:5,                 from /usr/src/linux-2.4.18-om4/include/linux/sched.h:9,                 from /usr/src/linux-2.4.18-om4/include/linux/mm.h:4,                 from /usr/src/linux-2.4.18-om4/include/linux/slab.h:14,                 from /usr/src/linux-2.4.18-om4/include/linux/proc_fs.h:5,                 from init/main.c:15:/usr/src/linux-2.4.18-om4/include/linux/ncp_fs_i.h:26: warning: âpackedâ attribute ignored for field of type â__u8â/usr/src/linux-2.4.18-om4/include/linux/ncp_fs_i.h:27: warning: âpackedâ attribute ignored for field of type â__u8[6]âIn file included from /usr/src/linux-2.4.18-om4/include/linux/ncp_mount.h:12,                 from /usr/src/linux-2.4.18-om4/include/linux/ncp_fs_sb.h:12,                 from /usr/src/linux-2.4.18-om4/include/linux/fs.h:749,                 from /usr/src/linux-2.4.18-om4/include/linux/capability.h:17,                 from /usr/src/linux-2.4.18-om4/include/linux/binfmts.h:5,                 from /usr/src/linux-2.4.18-om4/include/linux/sched.h:9,                 from /usr/src/linux-2.4.18-om4/include/linux/mm.h:4,                 from /usr/src/linux-2.4.18-om4/include/linux/slab.h:14,                 from /usr/src/linux-2.4.18-om4/include/linux/proc_fs.h:5,                 from init/main.c:15:/usr/src/linux-2.4.18-om4/include/linux/ncp.h:24: warning: âpackedâ attribute ignored for field of type â__u8â/usr/src/linux-2.4.18-om4/include/linux/ncp.h:25: warning: âpackedâ attribute ignored for field of type â__u8â/usr/src/linux-2.4.18-om4/include/linux/ncp.h:26: warning: âpackedâ attribute ignored for field of type â__u8â/usr/src/linux-2.4.18-om4/include/linux/ncp.h:27: warning: âpackedâ attribute ignored for field of type â__u8â/usr/src/linux-2.4.18-om4/include/linux/ncp.h:28: warning: âpackedâ attribute ignored for field of type â__u8â/usr/src/linux-2.4.18-om4/include/linux/ncp.h:29: warning: âpackedâ attribute ignored for field of type â__u8[]â/usr/src/linux-2.4.18-om4/include/linux/ncp.h:37: warning: âpackedâ attribute ignored for field of type â__u8â/usr/src/linux-2.4.18-om4/include/linux/ncp.h:38: warning: âpackedâ attribute ignored for field of type â__u8â/usr/src/linux-2.4.18-om4/include/linux/ncp.h:39: warning: âpackedâ attribute ignored for field of type â__u8â/usr/src/linux-2.4.18-om4/include/linux/ncp.h:40: warning: âpackedâ attribute ignored for field of type â__u8â/usr/src/linux-2.4.18-om4/include/linux/ncp.h:41: warning: âpackedâ attribute ignored for field of type â__u8â/usr/src/linux-2.4.18-om4/include/linux/ncp.h:42: warning: âpackedâ attribute ignored for field of type â__u8â/usr/src/linux-2.4.18-om4/include/linux/ncp.h:43: warning: âpackedâ attribute ignored for field of type â__u8[]â/usr/src/linux-2.4.18-om4/include/linux/ncp.h:137: warning: âpackedâ attribute ignored for field of type â__u8â/usr/src/linux-2.4.18-om4/include/linux/ncp.h:138: warning: âpackedâ attribute ignored for field of type â__u8[256]â/usr/src/linux-2.4.18-om4/include/linux/ncp.h:174: warning: âpackedâ attribute ignored for field of type â__u8âIn file included from /usr/src/linux-2.4.18-om4/include/hpc/hpctask.h:13,                 from /usr/src/linux-2.4.18-om4/include/linux/sched.h:33,                 from /usr/src/linux-2.4.18-om4/include/linux/mm.h:4,                 from /usr/src/linux-2.4.18-om4/include/linux/slab.h:14,                 from /usr/src/linux-2.4.18-om4/include/linux/proc_fs.h:5,                 from init/main.c:15:/usr/src/linux-2.4.18-om4/include/hpc/defs.h:91: error: array type has incomplete element typeIn file included from /usr/src/linux-2.4.18-om4/include/linux/unistd.h:9,                 from init/main.c:17:/usr/src/linux-2.4.18-om4/include/asm/unistd.h:360: warning: conflicting types for built-in function â_exitâmake: *** [init/main.o] Error 1