All pastes #455229 Raw Edit

Miscellany

public text v1 · immutable
·published 2007-04-24 02:15 UTC
rendered paste body
=============
Building project xmlhelp
=============
/home/danmorg/gnomesvn/trunk/build/oof680-m14/xmlhelp/inc
-------------
/home/danmorg/gnomesvn/trunk/build/oof680-m14/xmlhelp/source/cxxhelp/db
-------------
/home/danmorg/gnomesvn/trunk/build/oof680-m14/xmlhelp/source/cxxhelp/provider
-------------
/home/danmorg/gnomesvn/trunk/build/oof680-m14/xmlhelp/source/cxxhelp/qe
-------------
/home/danmorg/gnomesvn/trunk/build/oof680-m14/xmlhelp/source/cxxhelp/util
-------------
/home/danmorg/gnomesvn/trunk/build/oof680-m14/xmlhelp/source/com/sun/star/help
dmake: Executing shell macro: $(PKGCONFIG) $(PKGCONFIG_PREFIX) --cflags $(PKGCONFIG_MODULES)
dmake: Executing shell macro: $(PKGCONFIG) $(PKGCONFIG_PREFIX) --libs $(PKGCONFIG_MODULES)
------------------------------
Making: ../../../../../unxlngi6.pro/obj/HelpLinker.obj
g++ -fmessage-length=0 -c -O2 -fno-strict-aliasing   -D_FILE_OFFSET_BITS=64 -I/usr/include/libxml2 -DSYSTEM_DB -I/usr/include -I.  -I../../../../../unxlngi6.pro/inc/HelpLinker -I../inc -I../../../../../inc/pch -I../../../../../inc -I../../../../../unx/inc -I../../../../../unxlngi6.pro/inc -I. -I/home/danmorg/gnomesvn/trunk/build/oof680-m14/solver/680/unxlngi6.pro/inc/stl -I/home/danmorg/gnomesvn/trunk/build/oof680-m14/solver/680/unxlngi6.pro/inc/external -I/home/danmorg/gnomesvn/trunk/build/oof680-m14/solver/680/unxlngi6.pro/inc -I/home/danmorg/gnomesvn/trunk/build/oof680-m14/solenv/unxlngi6/inc -I/home/danmorg/gnomesvn/trunk/build/oof680-m14/solenv/inc -I/home/danmorg/gnomesvn/trunk/build/oof680-m14/res -I/home/danmorg/gnomesvn/trunk/build/oof680-m14/solver/680/unxlngi6.pro/inc/stl -I/home/danmorg/gnomesvn/trunk/build/oof680-m14/solenv/inc/Xp31 -I/home/danmorg/jdk1.5.0_11/include -I/home/danmorg/jdk1.5.0_11/include/linux -I/home/danmorg/jdk1.5.0_11/include/native_threads/include -I/usr/include     -I/home/danmorg/gnomesvn/trunk/build/oof680-m14/solver/680/unxlngi6.pro/inc/offuh -I. -I../../../../../res -I. -pipe -mtune=pentiumpro -fvisibility-inlines-hidden -g -Wall -Wextra -Wendif-labels -Wshadow -Wno-ctor-dtor-privacy     -Wno-non-virtual-dtor    -DLINUX -DUNX -DVCL -DGCC -DC341 -DINTEL -DCVER=C341 -DNPTL -DGLIBC=2 -DX86 -D_PTHREADS -D_REENTRANT -DNEW_SOLAR -D_USE_NAMESPACE=1 -DSTLPORT_VERSION=400 -DHAVE_GCC_VISIBILITY_FEATURE -D__DMAKE -DUNIX -DCPPU_ENV=gcc3 -DGXX_INCLUDE_PATH=/usr/lib/gcc/i486-linux-gnu/4.0.3/../../../../include/c++/4.0.3 -DSUPD=680 -DPRODUCT -DNDEBUG -DPRODUCT_FULL -DOSL_DEBUG_LEVEL=0 -DOPTIMIZE -DGSTREAMER -DCUI -DSOLAR_JAVA -DOOF680=OOF680   -DMULTITHREAD  -DEXCEPTIONS_OFF -fno-exceptions  -o ../../../../../unxlngi6.pro/obj/HelpLinker.o /home/danmorg/gnomesvn/trunk/build/oof680-m14/xmlhelp/source/com/sun/star/help/HelpLinker.cxx
/usr/include/boost/mpl/eval_if.hpp:67: error: wrong number of template arguments (3, should be 2)
/home/danmorg/gnomesvn/trunk/build/oof680-m14/solver/680/unxlngi6.pro/inc/boost/mpl/lambda_fwd.hpp:28: error: provided for 'template<class T, class Arity> struct boost::mpl::lambda'
/home/danmorg/gnomesvn/trunk/build/oof680-m14/solver/680/unxlngi6.pro/inc/external/unicode/unistr.h: In member function 'int8_t icu_3_6::UnicodeString::doCompare(int32_t, int32_t, const icu_3_6::UnicodeString&, int32_t, int32_t) const':
/home/danmorg/gnomesvn/trunk/build/oof680-m14/solver/680/unxlngi6.pro/inc/external/unicode/unistr.h:3286: warning: declaration of 'length' shadows a member of 'this'
/home/danmorg/gnomesvn/trunk/build/oof680-m14/solver/680/unxlngi6.pro/inc/external/unicode/unistr.h: In member function 'int8_t icu_3_6::UnicodeString::doCompareCodePointOrder(int32_t, int32_t, const icu_3_6::UnicodeString&, int32_t, int32_t) const':
/home/danmorg/gnomesvn/trunk/build/oof680-m14/solver/680/unxlngi6.pro/inc/external/unicode/unistr.h:3380: warning: declaration of 'length' shadows a member of 'this'
/home/danmorg/gnomesvn/trunk/build/oof680-m14/solver/680/unxlngi6.pro/inc/external/unicode/unistr.h: In member function 'int8_t icu_3_6::UnicodeString::doCaseCompare(int32_t, int32_t, const icu_3_6::UnicodeString&, int32_t, int32_t, uint32_t) const':
/home/danmorg/gnomesvn/trunk/build/oof680-m14/solver/680/unxlngi6.pro/inc/external/unicode/unistr.h:3442: warning: declaration of 'length' shadows a member of 'this'
dmake:  Error code 1, while making '../../../../../unxlngi6.pro/obj/HelpLinker.obj'
'---* tg_merge.mk *---'

ERROR: Error 65280 occurred while making /home/danmorg/gnomesvn/trunk/build/oof680-m14/xmlhelp/source/com/sun/star/help
make: *** [stamp/build] Error 1
danmorg@danpc:~/gnomesvn/trunk$ make