make[4]: Leaving directory `/var/tmp/portage/kde-base/kdelibs-3.5.5-r10/work/kdelibs-3.5.5/kdeprint/cups/cupsdconf2'make[3]: *** [all-recursive] Error 1make[3]: Leaving directory `/var/tmp/portage/kde-base/kdelibs-3.5.5-r10/work/kdelibs-3.5.5/kdeprint/cups'make[2]: *** [all-recursive] Error 1make[2]: Leaving directory `/var/tmp/portage/kde-base/kdelibs-3.5.5-r10/work/kdelibs-3.5.5/kdeprint'make[1]: *** [all-recursive] Error 1make[1]: Leaving directory `/var/tmp/portage/kde-base/kdelibs-3.5.5-r10/work/kdelibs-3.5.5'make: *** [all] Error 2!!! ERROR: kde-base/kdelibs-3.5.5-r10 failed.Call stack: ebuild.sh, line 1614: Called dyn_compile ebuild.sh, line 971: Called qa_call 'src_compile' environment, line 4824: Called src_compile kdelibs-3.5.5-r10.ebuild, line 164: Called kde_src_compile kde.eclass, line 170: Called kde_src_compile 'all' kde.eclass, line 340: Called kde_src_compile 'myconf' 'configure' 'make' kde.eclass, line 336: Called die!!! died running emake, kde_src_compile:make!!! If you need support, post the topmost build error, and the call stack if relevant.!!! A complete build log is located at '/var/tmp/portage/kde-base/kdelibs-3.5.5-r10/temp/build.log'.