rendered paste body=> Required installed package digest>=20010302: digest-20060826 found
===> Building for vte-0.16.1
/usr/bin/make all-recursive
make[1]: Entering directory `/usr/pkgsrc/x11/vte/work/vte-0.16.1'
Making all in src
make[2]: Entering directory `/usr/pkgsrc/x11/vte/work/vte-0.16.1/src'
if /bin/sh ../libtool --tag=CC --mode=compile gcc -DHAVE_CONFIG_H -I. -I. -I.. -DDATADIR='"/usr/pkg/share"' -DLIBEXECDIR='"/usr/pkg/libexec"' -DLOCALEDIR='""' -I/usr/pkg/include -I/usr/include -I/usr/pkg/include/freetype2 -I/usr/pkg/include -I/usr/pkg/include/freetype2 -I/usr/pkg/include/glib/glib-2.0 -I/usr/pkg/lib/glib-2.0/include -I/usr/pkg/include/gtk-2.0 -I/usr/pkg/lib/gtk-2.0/include -I/usr/pkg/include/atk-1.0 -I/usr/pkg/include/cairo -I/usr/pkg/include/pango-1.0 -I/usr/pkg/include/libpng12 -I/usr/pkg/include/freetype2 -I/usr/pkg/include -DG_DISABLE_ASSERT -DG_LOG_DOMAIN=\"Vte\" -O2 -pipe -march=i486 -mtune=i686 -I/usr/pkg/include -I/usr/include -I/usr/pkg/include/freetype2 -Wall -Wextra -Wsign-compare -Werror-implicit-function-declaration -Wpointer-arith -Wwrite-strings -Wstrict-prototypes -Waggregate-return -Wcast-align -Wimplicit -Wmissing-prototypes -Wmissing-declarations -Wnested-externs -Wpacked -Wmissing-format-attribute -Wshadow -Wstrict-aliasing=2 -Winit-self -Wdeclaration-after-statement -Wold-style-definition -Wno-unused-parameter -fno-common -MT pty.lo -MD -MP -MF ".deps/pty.Tpo" -c -o pty.lo pty.c; \
then mv -f ".deps/pty.Tpo" ".deps/pty.Plo"; else rm -f ".deps/pty.Tpo"; exit 1; fi
gcc -DHAVE_CONFIG_H -I. -I.. -DDATADIR=\"/usr/pkg/share\" -DLIBEXECDIR=\"/usr/pkg/libexec\" -DLOCALEDIR=\"\" -I/usr/pkgsrc/x11/vte/work/.buildlink/include -I/usr/pkgsrc/x11/vte/work/.buildlink/include/freetype2 -I/usr/pkgsrc/x11/vte/work/.buildlink/include/glib/glib-2.0 -I/usr/pkgsrc/x11/vte/work/.buildlink/lib/glib-2.0/include -I/usr/pkgsrc/x11/vte/work/.buildlink/include/gtk-2.0 -I/usr/pkgsrc/x11/vte/work/.buildlink/lib/gtk-2.0/include -I/usr/pkgsrc/x11/vte/work/.buildlink/include/atk-1.0 -I/usr/pkgsrc/x11/vte/work/.buildlink/include/cairo -I/usr/pkgsrc/x11/vte/work/.buildlink/include/pango-1.0 -I/usr/pkgsrc/x11/vte/work/.buildlink/include/libpng12 -DG_DISABLE_ASSERT -DG_LOG_DOMAIN=\"Vte\" -O2 -pipe -march=i486 -mtune=i686 -Wall -Wextra -Wsign-compare -Werror-implicit-function-declaration -Wpointer-arith -Wwrite-strings -Wstrict-prototypes -Waggregate-return -Wcast-align -Wimplicit -Wmissing-prototypes -Wmissing-declarations -Wnested-externs -Wpacked -Wmissing-format-attribute -Wshadow -Wstrict-aliasing=2 -Winit-self -Wdeclaration-after-statement -Wold-style-definition -Wno-unused-parameter -fno-common -MT pty.lo -MD -MP -MF .deps/pty.Tpo -c pty.c -fPIC -DPIC -o .libs/pty.o
pty.c: In function `_vte_pty_ptsname':
pty.c:534: error: implicit declaration of function `ptsname_r'
pty.c:534: warning: nested extern declaration of `ptsname_r'
pty.c: In function `_vte_pty_getpt':
pty.c:572: error: implicit declaration of function `getpt'
pty.c:572: warning: nested extern declaration of `getpt'
pty.c: In function `_vte_pty_grantpt':
pty.c:591: error: implicit declaration of function `grantpt'
pty.c:591: warning: nested extern declaration of `grantpt'
pty.c: In function `_vte_pty_unlockpt':
pty.c:601: error: implicit declaration of function `unlockpt'
pty.c:601: warning: nested extern declaration of `unlockpt'
[wrapper.sh] note: The real command line, after the pkgsrc wrapper, was:
/usr/pkgsrc/x11/vte/work/.gcc/bin/gcc -DHAVE_CONFIG_H -I. -I.. -DDATADIR=\"/usr/pkg/share\" -DLIBEXECDIR=\"/usr/pkg/libexec\" -DLOCALEDIR=\"\" -I/usr/pkgsrc/x11/vte/work/.buildlink/include -I/usr/pkgsrc/x11/vte/work/.buildlink/include/freetype2 -I/usr/pkgsrc/x11/vte/work/.buildlink/include/glib/glib-2.0 -I/usr/pkgsrc/x11/vte/work/.buildlink/lib/glib-2.0/include -I/usr/pkgsrc/x11/vte/work/.buildlink/include/gtk-2.0 -I/usr/pkgsrc/x11/vte/work/.buildlink/lib/gtk-2.0/include -I/usr/pkgsrc/x11/vte/work/.buildlink/include/atk-1.0 -I/usr/pkgsrc/x11/vte/work/.buildlink/include/cairo -I/usr/pkgsrc/x11/vte/work/.buildlink/include/pango-1.0 -I/usr/pkgsrc/x11/vte/work/.buildlink/include/libpng12 -DG_DISABLE_ASSERT -DG_LOG_DOMAIN=\"Vte\" -O2 -pipe -march=i486 -mtune=i686 -Wall -Wextra -Wsign-compare -Werror-implicit-function-declaration -Wpointer-arith -Wwrite-strings -Wstrict-prototypes -Waggregate-return -Wcast-align -Wimplicit -Wmissing-prototypes -Wmissing-declarations -Wnested-externs -Wpacked -Wmissing-format-attribute -Wshadow -Wstrict-aliasing=2 -Winit-self -Wdeclaration-after-statement -Wold-style-definition -Wno-unused-parameter -fno-common -MT pty.lo -MD -MP -MF .deps/pty.Tpo -c pty.c -fPIC -DPIC -o .libs/pty.o -L/usr/pkgsrc/x11/vte/work/.buildlink/lib
[wrapper.sh] note: The real command line, after the pkgsrc wrapper, was:
/usr/pkg/bin/libtool --tag=CC --mode=compile gcc -DHAVE_CONFIG_H -I. -I.. -DDATADIR=\"/usr/pkg/share\" -DLIBEXECDIR=\"/usr/pkg/libexec\" -DLOCALEDIR=\"\" -I/usr/pkgsrc/x11/vte/work/.buildlink/include -I/usr/pkgsrc/x11/vte/work/.buildlink/include/freetype2 -I/usr/pkgsrc/x11/vte/work/.buildlink/include/glib/glib-2.0 -I/usr/pkgsrc/x11/vte/work/.buildlink/lib/glib-2.0/include -I/usr/pkgsrc/x11/vte/work/.buildlink/include/gtk-2.0 -I/usr/pkgsrc/x11/vte/work/.buildlink/lib/gtk-2.0/include -I/usr/pkgsrc/x11/vte/work/.buildlink/include/atk-1.0 -I/usr/pkgsrc/x11/vte/work/.buildlink/include/cairo -I/usr/pkgsrc/x11/vte/work/.buildlink/include/pango-1.0 -I/usr/pkgsrc/x11/vte/work/.buildlink/include/libpng12 -DG_DISABLE_ASSERT -DG_LOG_DOMAIN=\"Vte\" -O2 -pipe -march=i486 -mtune=i686 -Wall -Wextra -Wsign-compare -Werror-implicit-function-declaration -Wpointer-arith -Wwrite-strings -Wstrict-prototypes -Waggregate-return -Wcast-align -Wimplicit -Wmissing-prototypes -Wmissing-declarations -Wnested-externs -Wpacked -Wmissing-format-attribute -Wshadow -Wstrict-aliasing=2 -Winit-self -Wdeclaration-after-statement -Wold-style-definition -Wno-unused-parameter -fno-common -MT pty.lo -MD -MP -MF .deps/pty.Tpo -c -o pty.lo pty.c
make[2]: *** [pty.lo] Error 1
make[2]: Leaving directory `/usr/pkgsrc/x11/vte/work/vte-0.16.1/src'
make[1]: *** [all-recursive] Error 1
make[1]: Leaving directory `/usr/pkgsrc/x11/vte/work/vte-0.16.1'
make: *** [all] Error 2
*** Error code 2
Stop.
bmake: stopped in /usr/pkgsrc/x11/vte
*** Error code 1
Stop.
bmake: stopped in /usr/pkgsrc/x11/vte