All pastes #454829 Raw Edit

Unnamed

public text v1 · immutable
·published 2007-04-23 20:58 UTC
rendered paste body
make[1]: Entering directory `/home/digitalpioneer/Desktop/winex/libs/wpp'
make[1]: Nothing to be done for `all'.
make[1]: Leaving directory `/home/digitalpioneer/Desktop/winex/libs/wpp'
make[1]: Entering directory `/home/digitalpioneer/Desktop/winex/port'
make[1]: Nothing to be done for `all'.
make[1]: Leaving directory `/home/digitalpioneer/Desktop/winex/port'
make[1]: Entering directory `/home/digitalpioneer/Desktop/winex/unicode'
make[1]: `libwine_unicode.so' is up to date.
make[1]: Leaving directory `/home/digitalpioneer/Desktop/winex/unicode'
make[1]: Entering directory `/home/digitalpioneer/Desktop/winex/tools'
make[2]: Entering directory `/home/digitalpioneer/Desktop/winex/tools/winebuild'
make[2]: Nothing to be done for `all'.
make[2]: Leaving directory `/home/digitalpioneer/Desktop/winex/tools/winebuild'
make[2]: Entering directory `/home/digitalpioneer/Desktop/winex/tools/winedump'
make[2]: Nothing to be done for `all'.
make[2]: Leaving directory `/home/digitalpioneer/Desktop/winex/tools/winedump'
make[2]: Entering directory `/home/digitalpioneer/Desktop/winex/tools/wmc'
make[2]: Nothing to be done for `all'.
make[2]: Leaving directory `/home/digitalpioneer/Desktop/winex/tools/wmc'
make[2]: Entering directory `/home/digitalpioneer/Desktop/winex/tools/wrc'
gcc -MMD -c  -I. -I. -I../../include -I../../include  -g -O2 -Wall -mpreferred-stack-boundary=2 -fno-keep-static-consts -D__const=const -fno-strict-aliasing -Wa,--execstack -D__int8=char -D__int16=short -D__int32=int "-D__int64=long long" -D__WINE__ -D_REENTRANT  -o lex.ppl.o lex.ppl.c
./ppl.l:82:1: warning: "/*" within comment
./ppl.l:91:2: error: #endif without #if
./ppl.l: In function 'pplex':
./ppl.l:306: error: 'seen_junk' undeclared (first use in this function)
./ppl.l:306: error: (Each undeclared identifier is reported only once
./ppl.l:306: error: for each function it appears in.)
./ppl.l:306: error: 'pp_pp' undeclared (first use in this function)
./ppl.l:311: error: 'pp_ignore' undeclared (first use in this function)
./ppl.l:311: warning: implicit declaration of function 'yy_pp_state'
./ppl.l:311: error: 'pp_inc' undeclared (first use in this function)
./ppl.l:311: error: 'tINCLUDE' undeclared (first use in this function)
./ppl.l:311: error: 'pp_eol' undeclared (first use in this function)
./ppl.l:312: error: called object 'yy_current_state' is not a function
./ppl.l:312: error: 'pp_def' undeclared (first use in this function)
./ppl.l:313: error: 'tERROR' undeclared (first use in this function)
./ppl.l:314: error: 'tWARNING' undeclared (first use in this function)
./ppl.l:315: error: 'tPRAGMA' undeclared (first use in this function)
./ppl.l:316: error: 'tPPIDENT' undeclared (first use in this function)
./ppl.l:317: error: 'pp_ifd' undeclared (first use in this function)
./ppl.l:317: error: 'tUNDEF' undeclared (first use in this function)
./ppl.l:318: error: 'tIFDEF' undeclared (first use in this function)
./ppl.l:319: error: 'tIFNDEF' undeclared (first use in this function)
./ppl.l:320: error: 'pp_if' undeclared (first use in this function)
./ppl.l:320: error: 'tIF' undeclared (first use in this function)
./ppl.l:321: error: 'tELIF' undeclared (first use in this function)
./ppl.l:322: error: 'tELSE' undeclared (first use in this function)
./ppl.l:323: error: 'tENDIF' undeclared (first use in this function)
./ppl.l:324: error: 'pp_line' undeclared (first use in this function)
./ppl.l:324: error: 'tLINE' undeclared (first use in this function)
./ppl.l:325: error: 'tGCCLINE' undeclared (first use in this function)
./ppl.l:326: warning: implicit declaration of function 'pperror'
./ppl.l:327: warning: implicit declaration of function 'newline'
./ppl.l:327: error: 'tNL' undeclared (first use in this function)
./ppl.l:335: warning: implicit declaration of function 'make_number'
./ppl.l:335: error: 'pplval' undeclared (first use in this function)
./ppl.l:336: warning: implicit declaration of function 'new_string'
./ppl.l:336: warning: implicit declaration of function 'add_string'
./ppl.l:336: error: 'pp_iqs' undeclared (first use in this function)
./ppl.l:337: error: 'pp_dqs' undeclared (first use in this function)
./ppl.l:341: error: called object 'yy_current_state' is not a function
./ppl.l:363: error: 'pp_defined' undeclared (first use in this function)
./ppl.l:363: error: 'tDEFINED' undeclared (first use in this function)
./ppl.l:364: error: 'tLSHIFT' undeclared (first use in this function)
./ppl.l:365: error: 'tRSHIFT' undeclared (first use in this function)
./ppl.l:366: error: 'tLOGAND' undeclared (first use in this function)
./ppl.l:367: error: 'tLOGOR' undeclared (first use in this function)
./ppl.l:368: error: 'tEQ' undeclared (first use in this function)
./ppl.l:369: error: 'tNE' undeclared (first use in this function)
./ppl.l:370: error: 'tLTE' undeclared (first use in this function)
./ppl.l:371: error: 'tGTE' undeclared (first use in this function)
./ppl.l:376: error: 'pp_sqs' undeclared (first use in this function)
./ppl.l:384: warning: implicit declaration of function 'xstrdup'
./ppl.l:384: error: 'tIDENT' undeclared (first use in this function)
./ppl.l:407: error: 'tLITERAL' undeclared (first use in this function)
./ppl.l:410: error: called object 'yy_current_state' is not a function
./ppl.l:416: error: 'pp_macro' undeclared (first use in this function)
./ppl.l:416: error: 'tMACRO' undeclared (first use in this function)
./ppl.l:417: error: 'pp_define' undeclared (first use in this function)
./ppl.l:417: error: 'tDEFINE' undeclared (first use in this function)
./ppl.l:436: error: 'pp_mbody' undeclared (first use in this function)
./ppl.l:436: error: 'tMACROEND' undeclared (first use in this function)
./ppl.l:440: error: 'tELIPSIS' undeclared (first use in this function)
./ppl.l:449: error: 'tCONCAT' undeclared (first use in this function)
./ppl.l:450: error: 'tSTRINGIZE' undeclared (first use in this function)
./ppl.l:468: error: 'pp_macscan' undeclared (first use in this function)
./ppl.l:475: error: 'macexpstackentry_t' undeclared (first use in this function)
./ppl.l:475: error: 'mac' undeclared (first use in this function)
./ppl.l:475: warning: implicit declaration of function 'pop_macro'
./ppl.l:477: warning: implicit declaration of function 'put_buffer'
./ppl.l:479: warning: implicit declaration of function 'free_macro'
./ppl.l:487: warning: implicit declaration of function 'MACROPARENTHESES'
./ppl.l:487: error: invalid lvalue in increment
./ppl.l:488: warning: implicit declaration of function 'add_text_to_macro'
./ppl.l:491: error: invalid lvalue in decrement
./ppl.l:494: warning: implicit declaration of function 'macro_add_arg'
./ppl.l:507: error: 'pp_comment' undeclared (first use in this function)
./ppl.l:508: error: 'line_number' undeclared (first use in this function)
./ppl.l:508: error: 'char_number' undeclared (first use in this function)
./ppl.l:525: warning: implicit declaration of function 'ppwarning'
./ppl.l:537: error: called object 'yy_current_state' is not a function
./ppl.l:544: error: 'RCINCL' undeclared (first use in this function)
./ppl.l:545: error: called object 'yy_current_state' is not a function
./ppl.l:546: warning: implicit declaration of function 'get_string'
./ppl.l:547: error: 'tDQSTRING' undeclared (first use in this function)
./ppl.l:549: warning: implicit declaration of function 'put_string'
./ppl.l:556: error: called object 'yy_current_state' is not a function
./ppl.l:562: error: 'tSQSTRING' undeclared (first use in this function)
./ppl.l:572: error: 'tIQSTRING' undeclared (first use in this function)
./ppl.l:602: warning: implicit declaration of function 'string_start'
./ppl.l:609: error: 'pp_entry_t' undeclared (first use in this function)
./ppl.l:609: error: 'ppp' undeclared (first use in this function)
./ppl.l:611: warning: implicit declaration of function 'pplookup'
./ppl.l:613: error: called object 'yy_current_state' is not a function
./ppl.l:616: error: called object 'yy_current_state' is not a function
./ppl.l:622: error: called object 'yy_current_state' is not a function
./ppl.l:622: error: 'INITIAL' undeclared (first use in this function)
./ppl.l:624: error: 'tRCINCLUDE' undeclared (first use in this function)
./ppl.l:633: error: 'def_special' undeclared (first use in this function)
./ppl.l:634: warning: implicit declaration of function 'expand_special'
./ppl.l:636: error: 'def_define' undeclared (first use in this function)
./ppl.l:637: warning: implicit declaration of function 'expand_define'
./ppl.l:639: error: 'def_macro' undeclared (first use in this function)
./ppl.l:640: error: 'pp_macign' undeclared (first use in this function)
./ppl.l:641: warning: implicit declaration of function 'push_macro'
./ppl.l:644: warning: implicit declaration of function 'internal_error'
./ppl.l:668: error: 'tRCINCLUDEPATH' undeclared (first use in this function)
./ppl.l:681: warning: implicit declaration of function 'isprint'
./ppl.l:697: error: 'pp_macexp' undeclared (first use in this function)
./ppl.l:685: error: 'bufferstackentry_t' undeclared (first use in this function)
./ppl.l:685: error: 'bep' undeclared (first use in this function)
./ppl.l:685: warning: implicit declaration of function 'pop_buffer'
./ppl.l:687: warning: implicit declaration of function 'get_if_depth'
./ppl.l:700: warning: implicit declaration of function 'expand_macro'
./ppl.l: At top level:
./ppl.l:731: warning: conflicting types for 'newline'
./ppl.l:731: error: static declaration of 'newline' follows non-static declaration
./ppl.l:327: error: previous implicit declaration of 'newline' was here
./ppl.l: In function 'newline':
./ppl.l:732: error: 'line_number' undeclared (first use in this function)
./ppl.l:733: error: 'char_number' undeclared (first use in this function)
./ppl.l:738: error: 'ncontinuations' undeclared (first use in this function)
./ppl.l: At top level:
./ppl.l:771: error: expected declaration specifiers or '...' before 'YYSTYPE'
./ppl.l:772: error: static declaration of 'make_number' follows non-static declaration
./ppl.l:335: error: previous implicit declaration of 'make_number' was here
./ppl.l: In function 'make_number':
./ppl.l:779: warning: implicit declaration of function 'toupper'
./ppl.l:813: error: 'val' undeclared (first use in this function)
./ppl.l:814: error: 'tULONG' undeclared (first use in this function)
./ppl.l:819: error: 'tSLONG' undeclared (first use in this function)
./ppl.l:824: error: 'win32' undeclared (first use in this function)
./ppl.l:828: error: 'tUINT' undeclared (first use in this function)
./ppl.l:842: error: 'tSINT' undeclared (first use in this function)
./ppl.l: At top level:
./ppl.l:853: error: expected ')' before '*' token
./ppl.l:902: error: expected ')' before '*' token
./ppl.l: In function 'add_text':
./ppl.l:930: error: 'ALLOCBLOCKSIZE' undeclared (first use in this function)
./ppl.l:931: warning: implicit declaration of function 'xrealloc'
./ppl.l:931: warning: assignment makes pointer from integer without a cast
./ppl.l: At top level:
./ppl.l:939: error: expected '=', ',', ';', 'asm' or '__attribute__' before '*' token
./ppl.l:1036: error: expected ')' before '*' token
./ppl.l:1115: warning: conflicting types for 'new_string'
./ppl.l:1115: error: static declaration of 'new_string' follows non-static declaration
./ppl.l:336: error: previous implicit declaration of 'new_string' was here
./ppl.l: In function 'new_string':
./ppl.l:1120: error: 'strbuf_idx' undeclared (first use in this function)
./ppl.l:1121: error: 'str_startline' undeclared (first use in this function)
./ppl.l:1121: error: 'line_number' undeclared (first use in this function)
./ppl.l: At top level:
./ppl.l:1125: warning: conflicting types for 'add_string'
./ppl.l:1125: error: static declaration of 'add_string' follows non-static declaration
./ppl.l:336: error: previous implicit declaration of 'add_string' was here
./ppl.l: In function 'add_string':
./ppl.l:1128: error: 'strbuf_idx' undeclared (first use in this function)
./ppl.l:1128: error: 'strbuf_alloc' undeclared (first use in this function)
./ppl.l:1130: error: 'ALLOCBLOCKSIZE' undeclared (first use in this function)
./ppl.l:1131: error: 'strbuffer' undeclared (first use in this function)
./ppl.l: At top level:
./ppl.l:1140: error: conflicting types for 'get_string'
./ppl.l:546: error: previous implicit declaration of 'get_string' was here
./ppl.l: In function 'get_string':
./ppl.l:1141: warning: implicit declaration of function 'xmalloc'
./ppl.l:1141: error: 'strbuf_idx' undeclared (first use in this function)
./ppl.l:1142: error: 'strbuffer' undeclared (first use in this function)
./ppl.l: At top level:
./ppl.l:1151: warning: conflicting types for 'put_string'
./ppl.l:1151: error: static declaration of 'put_string' follows non-static declaration
./ppl.l:549: error: previous implicit declaration of 'put_string' was here
./ppl.l: In function 'put_string':
./ppl.l:1152: error: 'strbuffer' undeclared (first use in this function)
./ppl.l:1152: error: 'strbuf_idx' undeclared (first use in this function)
./ppl.l: At top level:
./ppl.l:1159: error: static declaration of 'string_start' follows non-static declaration
./ppl.l:602: error: previous implicit declaration of 'string_start' was here
./ppl.l: In function 'string_start':
./ppl.l:1160: error: 'str_startline' undeclared (first use in this function)
./ppl.l: At top level:
./ppl.l:1169: error: expected ')' before '*' token
./ppl.l:1207: error: expected '=', ',', ';', 'asm' or '__attribute__' before '*' token
./ppl.l:1292: error: expected ')' before '*' token
./ppl.l:1303: error: expected '=', ',', ';', 'asm' or '__attribute__' before '*' token
./ppl.l:1308: error: expected '=', ',', ';', 'asm' or '__attribute__' before '*' token
./ppl.l:1315: error: expected ')' before '*' token
./ppl.l:1331: warning: conflicting types for 'add_text_to_macro'
./ppl.l:1331: error: static declaration of 'add_text_to_macro' follows non-static declaration
./ppl.l:488: error: previous implicit declaration of 'add_text_to_macro' was here
./ppl.l: In function 'add_text_to_macro':
./ppl.l:1332: error: 'macexpstackentry_t' undeclared (first use in this function)
./ppl.l:1332: error: 'mep' undeclared (first use in this function)
./ppl.l:1332: warning: implicit declaration of function 'top_macro'
./ppl.l:1334: warning: implicit declaration of function 'assert'
./ppl.l:1338: warning: implicit declaration of function 'max'
./ppl.l:1338: error: 'ALLOCBLOCKSIZE' undeclared (first use in this function)
./ppl.l: At top level:
./ppl.l:1347: warning: conflicting types for 'macro_add_arg'
./ppl.l:1347: error: static declaration of 'macro_add_arg' follows non-static declaration
./ppl.l:494: error: previous implicit declaration of 'macro_add_arg' was here
./ppl.l: In function 'macro_add_arg':
./ppl.l:1350: error: 'macexpstackentry_t' undeclared (first use in this function)
./ppl.l:1350: error: 'mep' undeclared (first use in this function)
./ppl.l:1369: error: 'debuglevel' undeclared (first use in this function)
./ppl.l:1369: error: 'DEBUGLEVEL_PPLEX' undeclared (first use in this function)
./ppl.l:1371: error: 'input_name' undeclared (first use in this function)
./ppl.l:1372: error: 'line_number' undeclared (first use in this function)
./ppl.l:1379: error: 'pp_macexp' undeclared (first use in this function)
./ppl.l:1380: warning: implicit declaration of function 'push_buffer'
./ppl.l: In function 'macro_add_expansion':
./ppl.l:1388: error: 'macexpstackentry_t' undeclared (first use in this function)
./ppl.l:1388: error: 'mep' undeclared (first use in this function)
./ppl.l:1397: error: 'debuglevel' undeclared (first use in this function)
./ppl.l:1397: error: 'DEBUGLEVEL_PPLEX' undeclared (first use in this function)
./ppl.l:1399: error: 'input_name' undeclared (first use in this function)
./ppl.l:1400: error: 'line_number' undeclared (first use in this function)
./ppl.l: At top level:
./ppl.l:1412: warning: conflicting types for 'put_buffer'
./ppl.l:1412: error: static declaration of 'put_buffer' follows non-static declaration
./ppl.l:477: error: previous implicit declaration of 'put_buffer' was here
./ppl.l: In function 'put_buffer':
./ppl.l:1416: error: 'pass_data' undeclared (first use in this function)
./ppl.l: In function 'do_include':
./ppl.l:1440: error: 'includelogicentry_t' undeclared (first use in this function)
./ppl.l:1440: error: 'iep' undeclared (first use in this function)
./ppl.l:1442: error: 'includelogiclist' undeclared (first use in this function)
./ppl.l:1463: warning: implicit declaration of function 'open_include'
./ppl.l:1463: warning: assignment makes pointer from integer without a cast
./ppl.l:1468: error: 'seen_junk' undeclared (first use in this function)
./ppl.l:1469: error: 'include_state' undeclared (first use in this function)
./ppl.l:1470: error: 'include_ppp' undeclared (first use in this function)
./ppl.l:1471: error: 'pass_data' undeclared (first use in this function)
./ppl.l:1474: error: 'debuglevel' undeclared (first use in this function)
./ppl.l:1474: error: 'DEBUGLEVEL_PPMSG' undeclared (first use in this function)
./ppl.l:1475: error: 'input_name' undeclared (first use in this function)
./ppl.l:1475: error: 'line_number' undeclared (first use in this function)
./ppl.l:1475: error: 'include_ifdepth' undeclared (first use in this function)
./ppl.l: In function 'push_ignore_state':
./ppl.l:1489: error: 'pp_ignore' undeclared (first use in this function)
make[2]: *** [lex.ppl.o] Error 1
make[2]: Leaving directory `/home/digitalpioneer/Desktop/winex/tools/wrc'
make[1]: *** [wrc] Error 2
make[1]: Leaving directory `/home/digitalpioneer/Desktop/winex/tools'
make: *** [tools] Error 2