rendered paste body$ bitbake -b ../../oe/org.openembedded.dev_typhoon/packages/gpephone/libvocenabler_0.1.bb
NOTE: package libvocenabler-0.1: started
NOTE: package libvocenabler-0.1-r0: task do_compile: started
ERROR: function do_compile failed
ERROR: log data follows (/home/pat/devel/oe/build/tornado_angstrom_gpephone_001/tmp/work/armv5te-angstrom-linux-gnueabi/libvocenabler-0.1-r0/temp/log.do_compile.6185)
| NOTE: make
| make all-recursive
| make[1]: Entering directory `/home/pat/devel/oe/build/tornado_angstrom_gpephone_001/tmp/work/armv5te-angstrom-linux-gnueabi/libvocenabler-0.1-r0/libvocenabler-0.1'
| Making all in src
| make[2]: Entering directory `/home/pat/devel/oe/build/tornado_angstrom_gpephone_001/tmp/work/armv5te-angstrom-linux-gnueabi/libvocenabler-0.1-r0/libvocenabler-0.1/src'
| /bin/sh ../arm-angstrom-linux-gnueabi-libtool --tag=CC --mode=link ccache arm-angstrom-linux-gnueabi-gcc -march=armv5te -mtune=arm926ej-s -isystem/home/pat/devel/oe/build/tornado_angstrom_gpephone_001/tmp/staging/arm-angstrom-linux-gnueabi/include -fexpensive-optimizations -fomit-frame-pointer -frename-registers -Os -L/home/pat/devel/oe/build/tornado_angstrom_gpephone_001/tmp/staging/arm-angstrom-linux-gnueabi/lib -Wl,-rpath-link,/home/pat/devel/oe/build/tornado_angstrom_gpephone_001/tmp/staging/arm-angstrom-linux-gnueabi/lib -Wl,-O1 -o libvocenabler.la -rpath /usr/lib dbus-if.lo vocevent.lo vocsession-mul.lo vocsession-wifi.lo vocsession-gsm.lo vocversion.lo tapi-gsm.lo tapi-wifi.lo -L/home/pat/devel/oe/build/tornado_angstrom_gpephone_001/tmp/staging/arm-angstrom-linux-gnueabi/lib -lXext -lXft -lXrender -lfreetype -lX11 -lfontconfig -ldbus-glib-1 -ldbus-1 -lgobject-2.0 -lglib-2.0 -llinphone
| grep: /usr/lib/libquickstream.la: No such file or directory
| /bin/sed: can't read /usr/lib/libquickstream.la: No such file or directory
| arm-angstrom-linux-gnueabi-libtool: link: `/usr/lib/libquickstream.la' is not a valid libtool archive
| make[2]: *** [libvocenabler.la] Error 1
| make[2]: Leaving directory `/home/pat/devel/oe/build/tornado_angstrom_gpephone_001/tmp/work/armv5te-angstrom-linux-gnueabi/libvocenabler-0.1-r0/libvocenabler-0.1/src'
| make[1]: *** [all-recursive] Error 1
| make[1]: Leaving directory `/home/pat/devel/oe/build/tornado_angstrom_gpephone_001/tmp/work/armv5te-angstrom-linux-gnueabi/libvocenabler-0.1-r0/libvocenabler-0.1'
| make: *** [all] Error 2
| FATAL: oe_runmake failed
NOTE: Task failed: /home/pat/devel/oe/build/tornado_angstrom_gpephone_001/tmp/work/armv5te-angstrom-linux-gnueabi/libvocenabler-0.1-r0/temp/log.do_compile.6185
NOTE: package libvocenabler-0.1-r0: task do_compile: failed
ERROR: TaskFailed event exception, aborting
NOTE: package libvocenabler-0.1: failed
ERROR: Build of 'libvocenabler' failed