root@p733:/home/hackphil/rt61/RT61_Linux_STA_Drv1.1.0.0/Module# make all
make -C /lib/modules/2.6.20-15-generic/build SUBDIRS=/home/hackphil/rt61/RT61_Linux_STA_Drv1.1.0.0/Module modules
make[1]: entrant dans le répertoire « /usr/src/linux-headers-2.6.20-15-generic »
CC [M] /home/hackphil/rt61/RT61_Linux_STA_Drv1.1.0.0/Module/rtmp_main.o
/home/hackphil/rt61/RT61_Linux_STA_Drv1.1.0.0/Module/rtmp_main.c: In function RT61_probe:
/home/hackphil/rt61/RT61_Linux_STA_Drv1.1.0.0/Module/rtmp_main.c:197: erreur: struct net_device has no member named get_wireless_stats
/home/hackphil/rt61/RT61_Linux_STA_Drv1.1.0.0/Module/rtmp_main.c: In function RT61_open:
/home/hackphil/rt61/RT61_Linux_STA_Drv1.1.0.0/Module/rtmp_main.c:326: attention : passing argument 2 of request_irq from incompatible pointer type
make[2]: *** [/home/hackphil/rt61/RT61_Linux_STA_Drv1.1.0.0/Module/rtmp_main.o] Erreur 1
make[1]: *** [_module_/home/hackphil/rt61/RT61_Linux_STA_Drv1.1.0.0/Module] Erreur 2
make[1]: quittant le répertoire « /usr/src/linux-headers-2.6.20-15-generic »
make: *** [all] Erreur 2
root@p733:/home/hackphil/rt61/RT61_Linux_STA_Drv1.1.0.0/Module#