Linking CXX shared module ../../lib/keramik.so
[ 1%] Generating manager.moc
[ 1%] Building CXX object dnssd/CMakeFiles/kdnssd.dir/mdnsd-servicebrowser.o
[ 1%] Generating script.moc
/home/sven/kdesvn/kdelibs/dnssd/mdnsd-servicebrowser_p.h:31: error: expected class-name before { token
/home/sven/kdesvn/kdelibs/dnssd/mdnsd-servicebrowser_p.h:34: error: expected `)' before * token
/home/sven/kdesvn/kdelibs/dnssd/mdnsd-servicebrowser_p.h:36: error: RemoteService was not declared in this scope
/home/sven/kdesvn/kdelibs/dnssd/mdnsd-servicebrowser_p.h:36: error: template argument 1 is invalid
/home/sven/kdesvn/kdelibs/dnssd/mdnsd-servicebrowser_p.h:37: error: RemoteService was not declared in this scope
/home/sven/kdesvn/kdelibs/dnssd/mdnsd-servicebrowser_p.h:37: error: template argument 1 is invalid
[ 1%] /home/sven/kdesvn/kdelibs/dnssd/mdnsd-servicebrowser_p.h:43: error: ISO C++ forbids declaration of ServiceBrowser with no type
/home/sven/kdesvn/kdelibs/dnssd/mdnsd-servicebrowser_p.h:43: error: expected ; before * token
/home/sven/kdesvn/kdelibs/dnssd/mdnsd-servicebrowser_p.h:44: error: QTimer does not name a type
/home/sven/kdesvn/kdelibs/dnssd/mdnsd-servicebrowser_p.h:31: warning: class DNSSD::ServiceBrowserPrivate has virtual functions but non-virtual destructor
Generating action.moc
/home/sven/kdesvn/kdelibs/dnssd/mdnsd-servicebrowser.cpp: In constructor DNSSD::ServiceBrowser::ServiceBrowser(const QString&, bool, const QString&, const QString&):
/home/sven/kdesvn/kdelibs/dnssd/mdnsd-servicebrowser.cpp:42: error: no matching function for call to DNSSD::ServiceBrowserPrivate::ServiceBrowserPrivate(DNSSD::ServiceBrowser* const)
/home/sven/kdesvn/kdelibs/dnssd/mdnsd-servicebrowser_p.h:31: note: candidates are: DNSSD::ServiceBrowserPrivate::ServiceBrowserPrivate()
/home/sven/kdesvn/kdelibs/dnssd/mdnsd-servicebrowser_p.h:31: note: DNSSD::ServiceBrowserPrivate::ServiceBrowserPrivate(const DNSSD::ServiceBrowserPrivate&)
/home/sven/kdesvn/kdelibs/dnssd/mdnsd-servicebrowser.cpp:48: error: class DNSSD::ServiceBrowserPrivate has no member named timeout
/home/sven/kdesvn/kdelibs/dnssd/mdnsd-servicebrowser.cpp:49: error: class DNSSD::ServiceBrowserPrivate has no member named timeout
/home/sven/kdesvn/kdelibs/dnssd/mdnsd-servicebrowser.cpp: In member function void DNSSD::ServiceBrowserPrivate::serviceResolved(bool):
/home/sven/kdesvn/kdelibs/dnssd/mdnsd-servicebrowser.cpp:68: error: sender was not declared in this scope
/home/sven/kdesvn/kdelibs/dnssd/mdnsd-servicebrowser.cpp:70: error: disconnect was not declared in this scope
/home/sven/kdesvn/kdelibs/dnssd/mdnsd-servicebrowser.cpp:71: error: request for member begin in ((DNSSD::ServiceBrowserPrivate*)this)->DNSSD::ServiceBrowserPrivate::m_duringResolve, which is of non-class type int
/home/sven/kdesvn/kdelibs/dnssd/mdnsd-servicebrowser.cpp:72: error: request for member end in ((DNSSD::ServiceBrowserPrivate*)this)->DNSSD::ServiceBrowserPrivate::m_duringResolve, which is of non-class type int
/home/sven/kdesvn/kdelibs/dnssd/mdnsd-servicebrowser.cpp:77: error: m_parent was not declared in this scope
/home/sven/kdesvn/kdelibs/dnssd/mdnsd-servicebrowser.cpp:79: error: request for member erase in ((DNSSD::ServiceBrowserPrivate*)this)->DNSSD::ServiceBrowserPrivate::m_duringResolve, which is of non-class type int
/home/sven/kdesvn/kdelibs/dnssd/mdnsd-servicebrowser.cpp: In member function virtual void DNSSD::ServiceBrowser::startBrowse():
/home/sven/kdesvn/kdelibs/dnssd/mdnsd-servicebrowser.cpp:86: error: class DNSSD::ServiceBrowserPrivate has no member named isRunning
/home/sven/kdesvn/kdelibs/dnssd/mdnsd-servicebrowser.cpp:93: error: class DNSSD::ServiceBrowserPrivate has no member named setRef
/home/sven/kdesvn/kdelibs/dnssd/mdnsd-servicebrowser.cpp:94: error: class DNSSD::ServiceBrowserPrivate has no member named isRunning
/home/sven/kdesvn/kdelibs/dnssd/mdnsd-servicebrowser.cpp:95: error: class DNSSD::ServiceBrowserPrivate has no member named timeout
/home/sven/kdesvn/kdelibs/dnssd/mdnsd-servicebrowser.cpp: In member function void DNSSD::ServiceBrowserPrivate::queryFin-servicebrowser.cpp:101: error: request for member count in ((DNSSD::ServiceBrowserPrivate*)this)->DNSSD::ServiceBrowserPrivate::m_duringResolve, which is of non-class type int
/home/sven/kdesvn/kdelibs/dnssd/mdnsd-servicebrowser.cpp:101: error: m_parent was not declared in this scope
/home/sven/kdesvn/kdelibs/dnssd/mdnsd-servicebrowser.cpp: In member function QList<KSharedPtr<DNSSD::RemoteService> > DNSSD::ServiceBrowser::services() const:
/home/sven/kdesvn/kdelibs/dnssd/mdnsd-servicebrowser.cpp:107: error: conversion from int to non-scalar type QList<KSharedPtr<DNSSD::RemoteService> > requested
/home/sven/kdesvn/kdelibs/dnssd/mdnsd-servicebrowser.cpp: In member function virtual void DNSSD::ServiceBrowserPrivate::customEvent(QEvent*):
/home/sven/kdesvn/kdelibs/dnssd/mdnsd-servicebrowser.cpp:116: error: stop was not declared in this scope
/home/sven/kdesvn/kdelibs/dnssd/mdnsd-servicebrowser.cpp:126: error: connect was not declared in this scope
/home/sven/kdesvn/kdelibs/dnssd/mdnsd-servicebrowser.cpp:131: error: m_parent was not declared in this scope
/home/sven/kdesvn/kdelibs/dnssd/mdnsd-servicebrowser.cpp:135: error: m_parent was not declared in this scope
/home/sven/kdesvn/kdelibs/dnssd/mdnsd-servicebrowser.cpp:136: error: request for member removeAll in ((DNSSD::ServiceBrowserPrivate*)this)->DNSSD::ServiceBrowserPrivate::m_services, which is of non-class type int
/home/sven/kdesvn/build/kdelibs/dnssd/mdnsd-servicebrowser_p.moc: In member function virtual void* DNSSD::ServiceBrowserPrivate::qt_metacast(const char*):
/home/sven/kdesvn/build/kdelibs/dnssd/mdnsd-servicebrowser_p.moc:58: error: cannot call member function virtual void* DNSSD::Responder::qt_metacast(const char*) without object
/home/sven/kdesvn/build/kdelibs/dnssd/mdnsd-servicebrowser_p.moc: In member function virtual int DNSSD::ServiceBrowserPrivate::qt_metacall(QMetaObject::Call, int, void**):
/home/sven/kdesvn/build/kdelibs/dnssd/mdnsd-servicebrowser_p.moc:63: error: cannot call member function virtual int DNSSD::Responder::qt_metacall(QMetaObject::Call, int, void**) without object
make[2]: *** [dnssd/CMakeFiles/kdnssd.dir/mdnsd-servicebrowser.o] Fehler 1
make[1]: *** [dnssd/CMakeFiles/kdnssd.dir/all] Fehler 2
make[1]: *** Warte auf noch nicht beendete Prozesse...
[ 1%] Generating actioncollection.moc
Scanning dependencies of target krosscore
[ 1%] Building CXX object kross/core/CMakeFiles/krosscore.dir/krossconfig.o
[ 2%] Building CXX object kross/core/CMakeFiles/krosscore.dir/variant.o
[ 2%] Building CXX object kross/core/CMakeFiles/krosscore.dir/interpreter.o
[ 2%] Building CXX object kross/core/CMakeFiles/krosscore.dir/script.o
[ 2%] Building CXX object kross/core/CMakeFiles/krosscore.dir/action.o
[ 2%] Building CXX object kross/core/CMakeFiles/krosscore.dir/actioncollection.o
[ 2%] Building CXX object kross/core/CMakeFiles/krosscore.dir/manager.o
Linking CXX shared library ../../lib/libkrosscore.so
make: *** [all] Fehler 2