All pastes #451226 Raw Edit

Stuff

public text v1 · immutable
·published 2007-04-21 10:12 UTC
rendered paste body
/home/mhanski/daten/download/cmake/cmake-2.4.6-Linux-i386/bin/cmake . -DWANT_CAIRO=1 -DCMAKE_INSTALL_PREFIX:PATH=/opt/scribus134cvs


[  5%] Building CXX object scribus/CMakeFiles/scribus.dir/scpainter.o
/home/mhanski/daten/scribus/cvs134/Scribus/scribus/scpainter.cpp:46:24: error: cairo-svg.h: Datei oder Verzeichnis nicht gefunden
/home/mhanski/daten/scribus/cvs134/Scribus/scribus/scpainter.cpp: In constructor ‘ScPainter::ScPainter(QString, unsigned int, unsigned int, double, int)’:
/home/mhanski/daten/scribus/cvs134/Scribus/scribus/scpainter.cpp:305: error: ‘cairo_svg_surface_create’ was not declared in this scope
/home/mhanski/daten/scribus/cvs134/Scribus/scribus/scpainter.cpp: In member function ‘virtual void ScPainter::beginLayer(double, int, FPointArray*)’:
/home/mhanski/daten/scribus/cvs134/Scribus/scribus/scpainter.cpp:354: error: ‘cairo_get_group_target’ was not declared in this scope
/home/mhanski/daten/scribus/cvs134/Scribus/scribus/scpainter.cpp:368: error: ‘cairo_push_group’ was not declared in this scope
/home/mhanski/daten/scribus/cvs134/Scribus/scribus/scpainter.cpp: In member function ‘virtual void ScPainter::endLayer()’:
/home/mhanski/daten/scribus/cvs134/Scribus/scribus/scpainter.cpp:389: error: ‘cairo_get_group_target’ was not declared in this scope
/home/mhanski/daten/scribus/cvs134/Scribus/scribus/scpainter.cpp:393: error: ‘cairo_surface_get_type’ was not declared in this scope
/home/mhanski/daten/scribus/cvs134/Scribus/scribus/scpainter.cpp:393: error: ‘CAIRO_SURFACE_TYPE_IMAGE’ was not declared in this scope
/home/mhanski/daten/scribus/cvs134/Scribus/scribus/scpainter.cpp:396: error: ‘cairo_image_surface_get_stride’ was not declared in this scope
/home/mhanski/daten/scribus/cvs134/Scribus/scribus/scpainter.cpp:397: error: ‘cairo_image_surface_get_data’ was not declared in this scope
/home/mhanski/daten/scribus/cvs134/Scribus/scribus/scpainter.cpp:607: error: ‘cairo_pop_group_to_source’ was not declared in this scope
make[2]: *** [scribus/CMakeFiles/scribus.dir/scpainter.o] Fehler 1
make[1]: *** [scribus/CMakeFiles/scribus.dir/all] Fehler 2
make: *** [all] Fehler 2

Installed libraries:

cairo 1.0.2-27.4
cairo-devel 
libsvg-cairo 0.1.6-16.2
libsvg-cairo-devel 0.1.6-16.2

Files in libsvg-cairo-devel:

/usr/include/svg-cairo.h
/usr/lib/libsvg-cairo.a
/usr/lib/libsvg-cairo.la
/usr/lib/libsvg-cairo.so
/usr/lib/pkgconfig/libsvg-cairo.pc