exports.c:1070: error: previous definition of ap_hack_apr_time_exp_lt was here
exports.c:2553: error: redefinition of ap_hack_apr_time_exp_get
exports.c:1071: error: previous definition of ap_hack_apr_time_exp_get was here
exports.c:2554: error: redefinition of ap_hack_apr_time_exp_gmt_get
exports.c:1072: error: previous definition of ap_hack_apr_time_exp_gmt_get was here
exports.c:2555: error: redefinition of ap_hack_apr_sleep
exports.c:1073: error: previous definition of ap_hack_apr_sleep was here
exports.c:2556: error: redefinition of ap_hack_apr_rfc822_date
exports.c:1074: error: previous definition of ap_hack_apr_rfc822_date was here
exports.c:2557: error: redefinition of ap_hack_apr_ctime
exports.c:1075: error: previous definition of ap_hack_apr_ctime was here
exports.c:2558: error: redefinition of ap_hack_apr_strftime
exports.c:1076: error: previous definition of ap_hack_apr_strftime was here
exports.c:2559: error: redefinition of ap_hack_apr_time_clock_hires
exports.c:1077: error: previous definition of ap_hack_apr_time_clock_hires was here
exports.c:2565: error: redefinition of ap_hack_apr_uid_current
exports.c:1091: error: previous definition of ap_hack_apr_uid_current was here
exports.c:2566: error: redefinition of ap_hack_apr_uid_name_get
exports.c:1092: error: previous definition of ap_hack_apr_uid_name_get was here
exports.c:2567: error: redefinition of ap_hack_apr_uid_get
exports.c:1093: error: previous definition of ap_hack_apr_uid_get was here
exports.c:2568: error: redefinition of ap_hack_apr_uid_homepath_get
exports.c:1094: error: previous definition of ap_hack_apr_uid_homepath_get was here
exports.c:2573: error: redefinition of ap_hack_apr_gid_name_get
exports.c:1099: error: previous definition of ap_hack_apr_gid_name_get was here
exports.c:2574: error: redefinition of ap_hack_apr_gid_get
exports.c:1100: error: previous definition of ap_hack_apr_gid_get was here
exports.c:2585: error: redefinition of ap_hack_apr_version
exports.c:1118: error: previous definition of ap_hack_apr_version was here
exports.c:2586: error: redefinition of ap_hack_apr_version_string
exports.c:1119: error: previous definition of ap_hack_apr_version_string was here
make[2]: *** [exports.lo] Error 1
make[2]: Leaving directory `/usr/local/apache/server'
make[1]: *** [all-recursive] Error 1
make[1]: Leaving directory `/usr/local/apache/server'
make: *** [all-recursive] Error 1