All pastes #44904 Raw Edit

Stuff

public text v1 · immutable
#44904 ·published 2006-03-08 17:26 UTC
rendered paste body
DUSE_E_CONFIG_H -I/usr/local/include -I/usr/local/include -I/usr/local/include -I/usr/local/include -I/usr/local/include -I/usr/local/include -I/usr/local/include    -Wall -g -O2 -MT e_mod_config.lo -MD -MP -MF ".deps/e_mod_config.Tpo" \
  -c -o e_mod_config.lo `test -f 'e_mod_config.c' || echo './'`e_mod_config.c; \
then mv -f ".deps/e_mod_config.Tpo" ".deps/e_mod_config.Plo"; \
else rm -f ".deps/e_mod_config.Tpo"; exit 1; \
fi
 gcc -DHAVE_CONFIG_H -I. -I. -I../.. -I. -I../.. -I/usr/local/include -I/usr/local/include -I/usr/local/include/enlightenment -DUSE_E_CONFIG_H -I/usr/local/include -I/usr/local/include -I/usr/local/include -I/usr/local/include -I/usr/local/include -I/usr/local/include -I/usr/local/include -Wall -g -O2 -MT e_mod_config.lo -MD -MP -MF .deps/e_mod_config.Tpo -c e_mod_config.c  -fPIC -DPIC -o .libs/e_mod_config.o
e_mod_config.c:21: error: syntax error before 'E_Config_Dialog_Data'
e_mod_config.c:22: error: syntax error before 'E_Config_Dialog_Data'
e_mod_config.c:23: error: syntax error before 'E_Config_Dialog_Data'
e_mod_config.c:24: error: syntax error before 'E_Config_Dialog_Data'
e_mod_config.c:25: error: syntax error before 'E_Config_Dialog_Data'
e_mod_config.c:51: error: syntax error before 'E_Config_Dialog_Data'
e_mod_config.c: In function '_fill_data':
e_mod_config.c:53: error: 'cfdata' undeclared (first use in this function)
e_mod_config.c:53: error: (Each undeclared identifier is reported only once
e_mod_config.c:53: error: for each function it appears in.)
e_mod_config.c:53: error: 'eb' undeclared (first use in this function)
e_mod_config.c: In function '_create_data':
e_mod_config.c:69: error: 'E_Config_Dialog_Data' undeclared (first use in this function)
e_mod_config.c:69: error: 'cfdata' undeclared (first use in this function)
e_mod_config.c:70: error: syntax error before ')' token
e_mod_config.c: At top level:
e_mod_config.c:75: error: syntax error before 'E_Config_Dialog_Data'
e_mod_config.c: In function '_free_data':
e_mod_config.c:79: error: 'cfdata' undeclared (first use in this function)
e_mod_config.c:81: error: 'cfd' undeclared (first use in this function)
e_mod_config.c: At top level:
e_mod_config.c:86: error: syntax error before 'E_Config_Dialog_Data'
e_mod_config.c: In function '_basic_create_widgets':
e_mod_config.c:89: error: 'E_Config_Dialog_Data' undeclared (first use in this function)
e_mod_config.c:89: error: 'cfdata' undeclared (first use in this function)
e_mod_config.c:92: error: 'cfd' undeclared (first use in this function)
e_mod_config.c:93: error: 'data' undeclared (first use in this function)
e_mod_config.c:95: error: 'evas' undeclared (first use in this function)
e_mod_config.c: At top level:
e_mod_config.c:128: error: syntax error before 'E_Config_Dialog_Data'
e_mod_config.c: In function '_basic_apply_data':
e_mod_config.c:132: error: 'cfd' undeclared (first use in this function)
e_mod_config.c:133: error: 'cfdata' undeclared (first use in this function)
e_mod_config.c: At top level:
e_mod_config.c:147: error: syntax error before 'E_Config_Dialog_Data'
e_mod_config.c: In function '_advanced_create_widgets':
e_mod_config.c:152: error: 'cfd' undeclared (first use in this function)
e_mod_config.c:154: error: 'evas' undeclared (first use in this function)
e_mod_config.c:156: error: 'cfdata' undeclared (first use in this function)
e_mod_config.c:176: warning: implicit declaration of function 'e_widget_slider_add'
e_mod_config.c:176: warning: assignment makes pointer from integer without a cast
e_mod_config.c:180: warning: assignment makes pointer from integer without a cast
e_mod_config.c: At top level:
e_mod_config.c:195: error: syntax error before 'E_Config_Dialog_Data'
e_mod_config.c: In function '_advanced_apply_data':
e_mod_config.c:199: error: 'cfd' undeclared (first use in this function)
e_mod_config.c:200: error: 'cfdata' undeclared (first use in this function)
make[3]: *** [e_mod_config.lo] Error 1
make[3]: Leaving directory `/home/vboulytchev/storage/e17/misc/engage/src/module'
make[2]: *** [all-recursive] Error 1
make[2]: Leaving directory `/home/vboulytchev/storage/e17/misc/engage/src'
make[1]: *** [all-recursive] Error 1
make[1]: Leaving directory `/home/vboulytchev/storage/e17/misc/engage'
make: *** [all] Error 2