All pastes #448481 Raw Edit

Something

public text v1 · immutable
·published 2007-04-19 17:55 UTC
rendered paste body
[H[J	==================================================================
	------------------ Windows(r) driver converter -------------------
	==================================================================

			INF file validation

	This .INF file appears to be ASCII.

	Press return to continue... [H[J	==================================================================
	------------------ Windows(r) driver converter -------------------
	==================================================================

			Driver file validation

	This .SYS file appears to be in Windows(r) PE format.

	Press return to continue... [H[J	==================================================================
	------------------ Windows(r) driver converter -------------------
	==================================================================

			Driver file conversion

	The script will now try to convert the .INF and .SYS files
	using the ndiscvt(1) utility. This utility can handle most
	.INF files; however, occasionally it can fail to parse some files
	due to subtle syntax issues: the .INF syntax is very complex,
	and the Windows(r) parser will sometimes allow files with small
	syntax errors to be processed correctly which ndiscvt(1) will
	not. If the conversion fails, you may have to edit the .INF
	file by hand to remove the offending lines.

	Press enter to try converting the files now: 
	Conversion was successful.

	Press enter to continue... [H[J	==================================================================
	------------------ Windows(r) driver converter -------------------
	==================================================================

			Firmware file conversion

	If your driver uses additional firmware files, please list them
	below. When you're finished, just press enter to continue. (If your
	driver doesn't need any extra firmware files, just press enter
	to move to the next step.)

	> [H[J	==================================================================
	------------------ Windows(r) driver converter -------------------
	==================================================================


	List of files converted firmware files:


	Press enter to continue... [H[J	==================================================================
	------------------ Windows(r) driver converter -------------------
	==================================================================

			Kernel module generation


	The script will now try to generate the kernel driver module.
	This is the last step. Once this module is generated, you should
	be able to load it just like any other FreeBSD driver module.

	Press enter to compile the stub module and generate the driver
	module now: 
	Generating Makefile... done.
	Building kernel module... In file included from /usr/share/misc/windrv_stub.c:57:
./windrv.h:821: error: excess elements in char array initializer
./windrv.h:821: error: (near initialization for `ndis_regvals[262].nc_val')
./windrv.h:822: warning: braces around scalar initializer
./windrv.h:822: warning: (near initialization for `ndis_regvals[262].nc_val[0]')
./windrv.h:822: warning: initialization makes integer from pointer without a cast
./windrv.h:822: error: initializer element is not computable at load time
./windrv.h:822: error: (near initialization for `ndis_regvals[262].nc_val[0]')
./windrv.h:822: error: excess elements in struct initializer
./windrv.h:822: error: (near initialization for `ndis_regvals[262].nc_val')
./windrv.h:822: error: excess elements in struct initializer
./windrv.h:822: error: (near initialization for `ndis_regvals[262].nc_val')
./windrv.h:823: warning: braces around scalar initializer
./windrv.h:823: warning: (near initialization for `ndis_regvals[262].nc_idx')
./windrv.h:823: warning: initialization makes integer from pointer without a cast
./windrv.h:824: warning: excess elements in scalar initializer
./windrv.h:824: warning: (near initialization for `ndis_regvals[262].nc_idx')
./windrv.h:825: warning: braces around scalar initializer
./windrv.h:825: warning: (near initialization for `ndis_regvals[262].nc_idx')
./windrv.h:825: warning: initialization makes integer from pointer without a cast
./windrv.h:825: warning: excess elements in scalar initializer
./windrv.h:825: warning: (near initialization for `ndis_regvals[262].nc_idx')
./windrv.h:825: warning: excess elements in scalar initializer
./windrv.h:825: warning: (near initialization for `ndis_regvals[262].nc_idx')
./windrv.h:826: error: extra brace group at end of initializer
./windrv.h:826: error: (near initialization for `ndis_regvals[262]')
./windrv.h:828: error: extra brace group at end of initializer
./windrv.h:828: error: (near initialization for `ndis_regvals[262]')
./windrv.h:828: warning: excess elements in struct initializer
./windrv.h:828: warning: (near initialization for `ndis_regvals[262]')
./windrv.h:829: error: extra brace group at end of initializer
./windrv.h:829: error: (near initialization for `ndis_regvals[262]')
./windrv.h:831: error: extra brace group at end of initializer
./windrv.h:831: error: (near initialization for `ndis_regvals[262]')
./windrv.h:831: warning: excess elements in struct initializer
./windrv.h:831: warning: (near initialization for `ndis_regvals[262]')
./windrv.h:832: error: extra brace group at end of initializer
./windrv.h:832: error: (near initialization for `ndis_regvals[262]')
./windrv.h:834: error: extra brace group at end of initializer
./windrv.h:834: error: (near initialization for `ndis_regvals[262]')
./windrv.h:834: warning: excess elements in struct initializer
./windrv.h:834: warning: (near initialization for `ndis_regvals[262]')
./windrv.h:835: error: extra brace group at end of initializer
./windrv.h:835: error: (near initialization for `ndis_regvals[262]')
./windrv.h:837: error: extra brace group at end of initializer
./windrv.h:837: error: (near initialization for `ndis_regvals[262]')
./windrv.h:837: warning: excess elements in struct initializer
./windrv.h:837: warning: (near initialization for `ndis_regvals[262]')
./windrv.h:838: error: extra brace group at end of initializer
./windrv.h:838: error: (near initialization for `ndis_regvals[262]')
./windrv.h:840: error: extra brace group at end of initializer
./windrv.h:840: error: (near initialization for `ndis_regvals[262]')
./windrv.h:840: warning: excess elements in struct initializer
./windrv.h:840: warning: (near initialization for `ndis_regvals[262]')
./windrv.h:841: error: extra brace group at end of initializer
./windrv.h:841: error: (near initialization for `ndis_regvals[262]')
./windrv.h:843: error: extra brace group at end of initializer
./windrv.h:843: error: (near initialization for `ndis_regvals[262]')
./windrv.h:843: warning: excess elements in struct initializer
./windrv.h:843: warning: (near initialization for `ndis_regvals[262]')
./windrv.h:844: error: extra brace group at end of initializer
./windrv.h:844: error: (near initialization for `ndis_regvals[262]')
./windrv.h:846: error: extra brace group at end of initializer
./windrv.h:846: error: (near initialization for `ndis_regvals[262]')
./windrv.h:846: warning: excess elements in struct initializer
./windrv.h:846: warning: (near initialization for `ndis_regvals[262]')
./windrv.h:847: error: extra brace group at end of initializer
./windrv.h:847: error: (near initialization for `ndis_regvals[262]')
./windrv.h:849: error: extra brace group at end of initializer
./windrv.h:849: error: (near initialization for `ndis_regvals[262]')
./windrv.h:849: warning: excess elements in struct initializer
./windrv.h:849: warning: (near initialization for `ndis_regvals[262]')
./windrv.h:850: error: extra brace group at end of initializer
./windrv.h:850: error: (near initialization for `ndis_regvals[262]')
./windrv.h:852: error: extra brace group at end of initializer
./windrv.h:852: error: (near initialization for `ndis_regvals[262]')
./windrv.h:852: warning: excess elements in struct initializer
./windrv.h:852: warning: (near initialization for `ndis_regvals[262]')
./windrv.h:853: error: extra brace group at end of initializer
./windrv.h:853: error: (near initialization for `ndis_regvals[262]')
./windrv.h:855: error: extra brace group at end of initializer
./windrv.h:855: error: (near initialization for `ndis_regvals[262]')
./windrv.h:855: warning: excess elements in struct initializer
./windrv.h:855: warning: (near initialization for `ndis_regvals[262]')
./windrv.h:856: error: extra brace group at end of initializer
./windrv.h:856: error: (near initialization for `ndis_regvals[262]')
./windrv.h:858: error: extra brace group at end of initializer
./windrv.h:858: error: (near initialization for `ndis_regvals[262]')
./windrv.h:858: warning: excess elements in struct initializer
./windrv.h:858: warning: (near initialization for `ndis_regvals[262]')
./windrv.h:859: error: extra brace group at end of initializer
./windrv.h:859: error: (near initialization for `ndis_regvals[262]')
./windrv.h:861: error: extra brace group at end of initializer
./windrv.h:861: error: (near initialization for `ndis_regvals[262]')
./windrv.h:861: warning: excess elements in struct initializer
./windrv.h:861: warning: (near initialization for `ndis_regvals[262]')
./windrv.h:862: error: extra brace group at end of initializer
./windrv.h:862: error: (near initialization for `ndis_regvals[262]')
./windrv.h:864: error: extra brace group at end of initializer
./windrv.h:864: error: (near initialization for `ndis_regvals[262]')
./windrv.h:864: warning: excess elements in struct initializer
./windrv.h:864: warning: (near initialization for `ndis_regvals[262]')
./windrv.h:865: error: extra brace group at end of initializer
./windrv.h:865: error: (near initialization for `ndis_regvals[262]')
./windrv.h:867: error: extra brace group at end of initializer
./windrv.h:867: error: (near initialization for `ndis_regvals[262]')
./windrv.h:867: warning: excess elements in struct initializer
./windrv.h:867: warning: (near initialization for `ndis_regvals[262]')
./windrv.h:868: error: extra brace group at end of initializer
./windrv.h:868: error: (near initialization for `ndis_regvals[262]')
./windrv.h:870: error: extra brace group at end of initializer
./windrv.h:870: error: (near initialization for `ndis_regvals[262]')
./windrv.h:870: warning: excess elements in struct initializer
./windrv.h:870: warning: (near initialization for `ndis_regvals[262]')
./windrv.h:871: error: extra brace group at end of initializer
./windrv.h:871: error: (near initialization for `ndis_regvals[262]')
./windrv.h:873: error: extra brace group at end of initializer
./windrv.h:873: error: (near initialization for `ndis_regvals[262]')
./windrv.h:873: warning: excess elements in struct initializer
./windrv.h:873: warning: (near initialization for `ndis_regvals[262]')
./windrv.h:874: error: extra brace group at end of initializer
./windrv.h:874: error: (near initialization for `ndis_regvals[262]')
./windrv.h:876: error: extra brace group at end of initializer
./windrv.h:876: error: (near initialization for `ndis_regvals[262]')
./windrv.h:876: warning: excess elements in struct initializer
./windrv.h:876: warning: (near initialization for `ndis_regvals[262]')
./windrv.h:877: error: extra brace group at end of initializer
./windrv.h:877: error: (near initialization for `ndis_regvals[262]')
./windrv.h:879: error: extra brace group at end of initializer
./windrv.h:879: error: (near initialization for `ndis_regvals[262]')
./windrv.h:879: warning: excess elements in struct initializer
./windrv.h:879: warning: (near initialization for `ndis_regvals[262]')
./windrv.h:880: error: extra brace group at end of initializer
./windrv.h:880: error: (near initialization for `ndis_regvals[262]')
./windrv.h:882: error: extra brace group at end of initializer
./windrv.h:882: error: (near initialization for `ndis_regvals[262]')
./windrv.h:882: warning: excess elements in struct initializer
./windrv.h:882: warning: (near initialization for `ndis_regvals[262]')
./windrv.h:883: error: extra brace group at end of initializer
./windrv.h:883: error: (near initialization for `ndis_regvals[262]')
./windrv.h:885: error: extra brace group at end of initializer
./windrv.h:885: error: (near initialization for `ndis_regvals[262]')
./windrv.h:885: warning: excess elements in struct initializer
./windrv.h:885: warning: (near initialization for `ndis_regvals[262]')
./windrv.h:886: error: extra brace group at end of initializer
./windrv.h:886: error: (near initialization for `ndis_regvals[262]')
./windrv.h:888: error: extra brace group at end of initializer
./windrv.h:888: error: (near initialization for `ndis_regvals[262]')
./windrv.h:888: warning: excess elements in struct initializer
./windrv.h:888: warning: (near initialization for `ndis_regvals[262]')
./windrv.h:889: error: extra brace group at end of initializer
./windrv.h:889: error: (near initialization for `ndis_regvals[262]')
./windrv.h:891: error: extra brace group at end of initializer
./windrv.h:891: error: (near initialization for `ndis_regvals[262]')
./windrv.h:891: warning: excess elements in struct initializer
./windrv.h:891: warning: (near initialization for `ndis_regvals[262]')
./windrv.h:892: error: extra brace group at end of initializer
./windrv.h:892: error: (near initialization for `ndis_regvals[262]')
./windrv.h:894: error: extra brace group at end of initializer
./windrv.h:894: error: (near initialization for `ndis_regvals[262]')
./windrv.h:894: warning: excess elements in struct initializer
./windrv.h:894: warning: (near initialization for `ndis_regvals[262]')
./windrv.h:895: error: extra brace group at end of initializer
./windrv.h:895: error: (near initialization for `ndis_regvals[262]')
./windrv.h:897: error: extra brace group at end of initializer
./windrv.h:897: error: (near initialization for `ndis_regvals[262]')
./windrv.h:897: warning: excess elements in struct initializer
./windrv.h:897: warning: (near initialization for `ndis_regvals[262]')
./windrv.h:898: error: extra brace group at end of initializer
./windrv.h:898: error: (near initialization for `ndis_regvals[262]')
./windrv.h:900: error: extra brace group at end of initializer
./windrv.h:900: error: (near initialization for `ndis_regvals[262]')
./windrv.h:900: warning: excess elements in struct initializer
./windrv.h:900: warning: (near initialization for `ndis_regvals[262]')
./windrv.h:901: error: extra brace group at end of initializer
./windrv.h:901: error: (near initialization for `ndis_regvals[262]')
./windrv.h:903: error: extra brace group at end of initializer
./windrv.h:903: error: (near initialization for `ndis_regvals[262]')
./windrv.h:903: warning: excess elements in struct initializer
./windrv.h:903: warning: (near initialization for `ndis_regvals[262]')
./windrv.h:904: error: extra brace group at end of initializer
./windrv.h:904: error: (near initialization for `ndis_regvals[262]')
./windrv.h:906: error: extra brace group at end of initializer
./windrv.h:906: error: (near initialization for `ndis_regvals[262]')
./windrv.h:906: warning: excess elements in struct initializer
./windrv.h:906: warning: (near initialization for `ndis_regvals[262]')
./windrv.h:907: error: extra brace group at end of initializer
./windrv.h:907: error: (near initialization for `ndis_regvals[262]')
./windrv.h:909: error: extra brace group at end of initializer
./windrv.h:909: error: (near initialization for `ndis_regvals[262]')
./windrv.h:909: warning: excess elements in struct initializer
./windrv.h:909: warning: (near initialization for `ndis_regvals[262]')
./windrv.h:910: error: extra brace group at end of initializer
./windrv.h:910: error: (near initialization for `ndis_regvals[262]')
./windrv.h:912: error: extra brace group at end of initializer
./windrv.h:912: error: (near initialization for `ndis_regvals[262]')
./windrv.h:912: warning: excess elements in struct initializer
./windrv.h:912: warning: (near initialization for `ndis_regvals[262]')
./windrv.h:913: error: extra brace group at end of initializer
./windrv.h:913: error: (near initialization for `ndis_regvals[262]')
./windrv.h:915: error: extra brace group at end of initializer
./windrv.h:915: error: (near initialization for `ndis_regvals[262]')
./windrv.h:915: warning: excess elements in struct initializer
./windrv.h:915: warning: (near initialization for `ndis_regvals[262]')
./windrv.h:916: error: extra brace group at end of initializer
./windrv.h:916: error: (near initialization for `ndis_regvals[262]')
./windrv.h:918: error: extra brace group at end of initializer
./windrv.h:918: error: (near initialization for `ndis_regvals[262]')
./windrv.h:918: warning: excess elements in struct initializer
./windrv.h:918: warning: (near initialization for `ndis_regvals[262]')
./windrv.h:919: error: extra brace group at end of initializer
./windrv.h:919: error: (near initialization for `ndis_regvals[262]')
./windrv.h:921: error: extra brace group at end of initializer
./windrv.h:921: error: (near initialization for `ndis_regvals[262]')
./windrv.h:921: warning: excess elements in struct initializer
./windrv.h:921: warning: (near initialization for `ndis_regvals[262]')
./windrv.h:922: error: extra brace group at end of initializer
./windrv.h:922: error: (near initialization for `ndis_regvals[262]')
./windrv.h:924: error: extra brace group at end of initializer
./windrv.h:924: error: (near initialization for `ndis_regvals[262]')
./windrv.h:924: warning: excess elements in struct initializer
./windrv.h:924: warning: (near initialization for `ndis_regvals[262]')
./windrv.h:925: error: extra brace group at end of initializer
./windrv.h:925: error: (near initialization for `ndis_regvals[262]')
./windrv.h:927: error: extra brace group at end of initializer
./windrv.h:927: error: (near initialization for `ndis_regvals[262]')
./windrv.h:927: warning: excess elements in struct initializer
./windrv.h:927: warning: (near initialization for `ndis_regvals[262]')
./windrv.h:928: error: extra brace group at end of initializer
./windrv.h:928: error: (near initialization for `ndis_regvals[262]')
./windrv.h:930: error: extra brace group at end of initializer
./windrv.h:930: error: (near initialization for `ndis_regvals[262]')
./windrv.h:930: warning: excess elements in struct initializer
./windrv.h:930: warning: (near initialization for `ndis_regvals[262]')
./windrv.h:931: error: extra brace group at end of initializer
./windrv.h:931: error: (near initialization for `ndis_regvals[262]')
./windrv.h:933: error: extra brace group at end of initializer
./windrv.h:933: error: (near initialization for `ndis_regvals[262]')
./windrv.h:933: warning: excess elements in struct initializer
./windrv.h:933: warning: (near initialization for `ndis_regvals[262]')
./windrv.h:934: error: extra brace group at end of initializer
./windrv.h:934: error: (near initialization for `ndis_regvals[262]')
./windrv.h:936: error: extra brace group at end of initializer
./windrv.h:936: error: (near initialization for `ndis_regvals[262]')
./windrv.h:936: warning: excess elements in struct initializer
./windrv.h:936: warning: (near initialization for `ndis_regvals[262]')
./windrv.h:937: error: extra brace group at end of initializer
./windrv.h:937: error: (near initialization for `ndis_regvals[262]')
./windrv.h:939: error: extra brace group at end of initializer
./windrv.h:939: error: (near initialization for `ndis_regvals[262]')
./windrv.h:939: warning: excess elements in struct initializer
./windrv.h:939: warning: (near initialization for `ndis_regvals[262]')
./windrv.h:940: error: extra brace group at end of initializer
./windrv.h:940: error: (near initialization for `ndis_regvals[262]')
./windrv.h:942: error: extra brace group at end of initializer
./windrv.h:942: error: (near initialization for `ndis_regvals[262]')
./windrv.h:942: warning: excess elements in struct initializer
./windrv.h:942: warning: (near initialization for `ndis_regvals[262]')
./windrv.h:943: error: extra brace group at end of initializer
./windrv.h:943: error: (near initialization for `ndis_regvals[262]')
./windrv.h:945: error: extra brace group at end of initializer
./windrv.h:945: error: (near initialization for `ndis_regvals[262]')
./windrv.h:945: warning: excess elements in struct initializer
./windrv.h:945: warning: (near initialization for `ndis_regvals[262]')
./windrv.h:946: error: extra brace group at end of initializer
./windrv.h:946: error: (near initialization for `ndis_regvals[262]')
./windrv.h:948: error: extra brace group at end of initializer
./windrv.h:948: error: (near initialization for `ndis_regvals[262]')
./windrv.h:948: warning: excess elements in struct initializer
./windrv.h:948: warning: (near initialization for `ndis_regvals[262]')
./windrv.h:949: error: extra brace group at end of initializer
./windrv.h:949: error: (near initialization for `ndis_regvals[262]')
./windrv.h:951: error: extra brace group at end of initializer
./windrv.h:951: error: (near initialization for `ndis_regvals[262]')
./windrv.h:951: warning: excess elements in struct initializer
./windrv.h:951: warning: (near initialization for `ndis_regvals[262]')
./windrv.h:952: error: extra brace group at end of initializer
./windrv.h:952: error: (near initialization for `ndis_regvals[262]')
./windrv.h:954: error: extra brace group at end of initializer
./windrv.h:954: error: (near initialization for `ndis_regvals[262]')
./windrv.h:956: error: extra brace group at end of initializer
./windrv.h:956: error: (near initialization for `ndis_regvals[262]')
./windrv.h:957: error: extra brace group at end of initializer
./windrv.h:957: error: (near initialization for `ndis_regvals[262]')
./windrv.h:959: error: extra brace group at end of initializer
./windrv.h:959: error: (near initialization for `ndis_regvals[262]')
./windrv.h:960: error: extra brace group at end of initializer
./windrv.h:960: error: (near initialization for `ndis_regvals[262]')
./windrv.h:962: error: extra brace group at end of initializer
./windrv.h:962: error: (near initialization for `ndis_regvals[262]')
./windrv.h:963: error: extra brace group at end of initializer
./windrv.h:963: error: (near initialization for `ndis_regvals[262]')
./windrv.h:965: error: extra brace group at end of initializer
./windrv.h:965: error: (near initialization for `ndis_regvals[262]')
./windrv.h:966: error: extra brace group at end of initializer
./windrv.h:966: error: (near initialization for `ndis_regvals[262]')
./windrv.h:968: error: extra brace group at end of initializer
./windrv.h:968: error: (near initialization for `ndis_regvals[262]')
./windrv.h:969: error: extra brace group at end of initializer
./windrv.h:969: error: (near initialization for `ndis_regvals[262]')
./windrv.h:971: error: extra brace group at end of initializer
./windrv.h:971: error: (near initialization for `ndis_regvals[262]')
./windrv.h:972: error: extra brace group at end of initializer
./windrv.h:972: error: (near initialization for `ndis_regvals[262]')
./windrv.h:974: error: extra brace group at end of initializer
./windrv.h:974: error: (near initialization for `ndis_regvals[262]')
./windrv.h:975: error: extra brace group at end of initializer
./windrv.h:975: error: (near initialization for `ndis_regvals[262]')
./windrv.h:977: error: extra brace group at end of initializer
./windrv.h:977: error: (near initialization for `ndis_regvals[262]')
./windrv.h:978: error: extra brace group at end of initializer
./windrv.h:978: error: (near initialization for `ndis_regvals[262]')
./windrv.h:980: error: extra brace group at end of initializer
./windrv.h:980: error: (near initialization for `ndis_regvals[262]')
./windrv.h:981: error: extra brace group at end of initializer
./windrv.h:981: error: (near initialization for `ndis_regvals[262]')
./windrv.h:983: error: extra brace group at end of initializer
./windrv.h:983: error: (near initialization for `ndis_regvals[262]')
./windrv.h:984: error: extra brace group at end of initializer
./windrv.h:984: error: (near initialization for `ndis_regvals[262]')
./windrv.h:986: error: extra brace group at end of initializer
./windrv.h:986: error: (near initialization for `ndis_regvals[262]')
./windrv.h:987: error: extra brace group at end of initializer
./windrv.h:987: error: (near initialization for `ndis_regvals[262]')
./windrv.h:989: error: extra brace group at end of initializer
./windrv.h:989: error: (near initialization for `ndis_regvals[262]')
./windrv.h:990: error: extra brace group at end of initializer
./windrv.h:990: error: (near initialization for `ndis_regvals[262]')
./windrv.h:992: error: extra brace group at end of initializer
./windrv.h:992: error: (near initialization for `ndis_regvals[262]')
./windrv.h:993: error: extra brace group at end of initializer
./windrv.h:993: error: (near initialization for `ndis_regvals[262]')
./windrv.h:995: error: extra brace group at end of initializer
./windrv.h:995: error: (near initialization for `ndis_regvals[262]')
./windrv.h:996: error: extra brace group at end of initializer
./windrv.h:996: error: (near initialization for `ndis_regvals[262]')
./windrv.h:998: error: extra brace group at end of initializer
./windrv.h:998: error: (near initialization for `ndis_regvals[262]')
./windrv.h:999: error: extra brace group at end of initializer
./windrv.h:999: error: (near initialization for `ndis_regvals[262]')
./windrv.h:1001: error: extra brace group at end of initializer
./windrv.h:1001: error: (near initialization for `ndis_regvals[262]')
./windrv.h:1002: error: extra brace group at end of initializer
./windrv.h:1002: error: (near initialization for `ndis_regvals[262]')
./windrv.h:1004: error: extra brace group at end of initializer
./windrv.h:1004: error: (near initialization for `ndis_regvals[262]')
./windrv.h:1005: error: extra brace group at end of initializer
./windrv.h:1005: error: (near initialization for `ndis_regvals[262]')
./windrv.h:1007: error: extra brace group at end of initializer
./windrv.h:1007: error: (near initialization for `ndis_regvals[262]')
./windrv.h:1008: error: extra brace group at end of initializer
./windrv.h:1008: error: (near initialization for `ndis_regvals[262]')
./windrv.h:1010: error: extra brace group at end of initializer
./windrv.h:1010: error: (near initialization for `ndis_regvals[262]')
./windrv.h:1011: error: extra brace group at end of initializer
./windrv.h:1011: error: (near initialization for `ndis_regvals[262]')
./windrv.h:1013: error: extra brace group at end of initializer
./windrv.h:1013: error: (near initialization for `ndis_regvals[262]')
./windrv.h:1014: error: extra brace group at end of initializer
./windrv.h:1014: error: (near initialization for `ndis_regvals[262]')
./windrv.h:1016: error: extra brace group at end of initializer
./windrv.h:1016: error: (near initialization for `ndis_regvals[262]')
./windrv.h:1017: error: extra brace group at end of initializer
./windrv.h:1017: error: (near initialization for `ndis_regvals[262]')
./windrv.h:1019: error: extra brace group at end of initializer
./windrv.h:1019: error: (near initialization for `ndis_regvals[262]')
./windrv.h:1020: error: extra brace group at end of initializer
./windrv.h:1020: error: (near initialization for `ndis_regvals[262]')
./windrv.h:1022: error: extra brace group at end of initializer
./windrv.h:1022: error: (near initialization for `ndis_regvals[262]')
./windrv.h:1023: error: extra brace group at end of initializer
./windrv.h:1023: error: (near initialization for `ndis_regvals[262]')
./windrv.h:1025: error: extra brace group at end of initializer
./windrv.h:1025: error: (near initialization for `ndis_regvals[262]')
./windrv.h:1026: error: extra brace group at end of initializer
./windrv.h:1026: error: (near initialization for `ndis_regvals[262]')
./windrv.h:1028: error: extra brace group at end of initializer
./windrv.h:1028: error: (near initialization for `ndis_regvals[262]')
./windrv.h:1029: error: extra brace group at end of initializer
./windrv.h:1029: error: (near initialization for `ndis_regvals[262]')
./windrv.h:1031: error: extra brace group at end of initializer
./windrv.h:1031: error: (near initialization for `ndis_regvals[262]')
./windrv.h:1032: error: extra brace group at end of initializer
./windrv.h:1032: error: (near initialization for `ndis_regvals[262]')
./windrv.h:1034: error: extra brace group at end of initializer
./windrv.h:1034: error: (near initialization for `ndis_regvals[262]')
./windrv.h:1035: error: extra brace group at end of initializer
./windrv.h:1035: error: (near initialization for `ndis_regvals[262]')
./windrv.h:1037: error: extra brace group at end of initializer
./windrv.h:1037: error: (near initialization for `ndis_regvals[262]')
./windrv.h:1038: error: extra brace group at end of initializer
./windrv.h:1038: error: (near initialization for `ndis_regvals[262]')
./windrv.h:1040: error: extra brace group at end of initializer
./windrv.h:1040: error: (near initialization for `ndis_regvals[262]')
./windrv.h:1041: error: extra brace group at end of initializer
./windrv.h:1041: error: (near initialization for `ndis_regvals[262]')
./windrv.h:1043: error: extra brace group at end of initializer
./windrv.h:1043: error: (near initialization for `ndis_regvals[262]')
./windrv.h:1044: error: extra brace group at end of initializer
./windrv.h:1044: error: (near initialization for `ndis_regvals[262]')
./windrv.h:1046: error: extra brace group at end of initializer
./windrv.h:1046: error: (near initialization for `ndis_regvals[262]')
./windrv.h:1047: error: extra brace group at end of initializer
./windrv.h:1047: error: (near initialization for `ndis_regvals[262]')
./windrv.h:1049: error: extra brace group at end of initializer
./windrv.h:1049: error: (near initialization for `ndis_regvals[262]')
./windrv.h:1050: error: extra brace group at end of initializer
./windrv.h:1050: error: (near initialization for `ndis_regvals[262]')
./windrv.h:1052: error: extra brace group at end of initializer
./windrv.h:1052: error: (near initialization for `ndis_regvals[262]')
./windrv.h:1053: error: extra brace group at end of initializer
./windrv.h:1053: error: (near initialization for `ndis_regvals[262]')
./windrv.h:1055: error: extra brace group at end of initializer
./windrv.h:1055: error: (near initialization for `ndis_regvals[262]')
./windrv.h:1056: error: extra brace group at end of initializer
./windrv.h:1056: error: (near initialization for `ndis_regvals[262]')
./windrv.h:1058: error: extra brace group at end of initializer
./windrv.h:1058: error: (near initialization for `ndis_regvals[262]')
./windrv.h:1059: error: extra brace group at end of initializer
./windrv.h:1059: error: (near initialization for `ndis_regvals[262]')
./windrv.h:1061: error: extra brace group at end of initializer
./windrv.h:1061: error: (near initialization for `ndis_regvals[262]')
./windrv.h:1062: error: extra brace group at end of initializer
./windrv.h:1062: error: (near initialization for `ndis_regvals[262]')
./windrv.h:1064: error: extra brace group at end of initializer
./windrv.h:1064: error: (near initialization for `ndis_regvals[262]')
./windrv.h:1065: error: extra brace group at end of initializer
./windrv.h:1065: error: (near initialization for `ndis_regvals[262]')
./windrv.h:1067: error: extra brace group at end of initializer
./windrv.h:1067: error: (near initialization for `ndis_regvals[262]')
./windrv.h:1068: error: extra brace group at end of initializer
./windrv.h:1068: error: (near initialization for `ndis_regvals[262]')
./windrv.h:1070: error: extra brace group at end of initializer
./windrv.h:1070: error: (near initialization for `ndis_regvals[262]')
./windrv.h:1071: error: extra brace group at end of initializer
./windrv.h:1071: error: (near initialization for `ndis_regvals[262]')
./windrv.h:1073: error: extra brace group at end of initializer
./windrv.h:1073: error: (near initialization for `ndis_regvals[262]')
./windrv.h:1074: error: extra brace group at end of initializer
./windrv.h:1074: error: (near initialization for `ndis_regvals[262]')
./windrv.h:1076: error: extra brace group at end of initializer
./windrv.h:1076: error: (near initialization for `ndis_regvals[262]')
./windrv.h:1077: error: extra brace group at end of initializer
./windrv.h:1077: error: (near initialization for `ndis_regvals[262]')
./windrv.h:1079: error: extra brace group at end of initializer
./windrv.h:1079: error: (near initialization for `ndis_regvals[262]')
./windrv.h:1080: error: extra brace group at end of initializer
./windrv.h:1080: error: (near initialization for `ndis_regvals[262]')
./windrv.h:1082: error: extra brace group at end of initializer
./windrv.h:1082: error: (near initialization for `ndis_regvals[262]')
./windrv.h:1083: error: extra brace group at end of initializer
./windrv.h:1083: error: (near initialization for `ndis_regvals[262]')
./windrv.h:1085: error: extra brace group at end of initializer
./windrv.h:1085: error: (near initialization for `ndis_regvals[262]')
./windrv.h:1086: error: extra brace group at end of initializer
./windrv.h:1086: error: (near initialization for `ndis_regvals[262]')
./windrv.h:1088: error: extra brace group at end of initializer
./windrv.h:1088: error: (near initialization for `ndis_regvals[262]')
./windrv.h:1089: error: extra brace group at end of initializer
./windrv.h:1089: error: (near initialization for `ndis_regvals[262]')
./windrv.h:1091: error: extra brace group at end of initializer
./windrv.h:1091: error: (near initialization for `ndis_regvals[262]')
./windrv.h:1092: error: extra brace group at end of initializer
./windrv.h:1092: error: (near initialization for `ndis_regvals[262]')
./windrv.h:1094: error: extra brace group at end of initializer
./windrv.h:1094: error: (near initialization for `ndis_regvals[262]')
./windrv.h:1095: error: extra brace group at end of initializer
./windrv.h:1095: error: (near initialization for `ndis_regvals[262]')
./windrv.h:1097: error: extra brace group at end of initializer
./windrv.h:1097: error: (near initialization for `ndis_regvals[262]')
./windrv.h:1098: error: extra brace group at end of initializer
./windrv.h:1098: error: (near initialization for `ndis_regvals[262]')
./windrv.h:1100: error: extra brace group at end of initializer
./windrv.h:1100: error: (near initialization for `ndis_regvals[262]')
./windrv.h:1101: error: extra brace group at end of initializer
./windrv.h:1101: error: (near initialization for `ndis_regvals[262]')
./windrv.h:1103: error: extra brace group at end of initializer
./windrv.h:1103: error: (near initialization for `ndis_regvals[262]')
./windrv.h:1104: error: extra brace group at end of initializer
./windrv.h:1104: error: (near initialization for `ndis_regvals[262]')
./windrv.h:1106: error: extra brace group at end of initializer
./windrv.h:1106: error: (near initialization for `ndis_regvals[262]')
./windrv.h:1107: error: extra brace group at end of initializer
./windrv.h:1107: error: (near initialization for `ndis_regvals[262]')
./windrv.h:1109: error: extra brace group at end of initializer
./windrv.h:1109: error: (near initialization for `ndis_regvals[262]')
./windrv.h:1110: error: extra brace group at end of initializer
./windrv.h:1110: error: (near initialization for `ndis_regvals[262]')
./windrv.h:1112: error: extra brace group at end of initializer
./windrv.h:1112: error: (near initialization for `ndis_regvals[262]')
./windrv.h:1113: error: extra brace group at end of initializer
./windrv.h:1113: error: (near initialization for `ndis_regvals[262]')
./windrv.h:1115: error: extra brace group at end of initializer
./windrv.h:1115: error: (near initialization for `ndis_regvals[262]')
./windrv.h:1116: error: extra brace group at end of initializer
./windrv.h:1116: error: (near initialization for `ndis_regvals[262]')
./windrv.h:1118: error: extra brace group at end of initializer
./windrv.h:1118: error: (near initialization for `ndis_regvals[262]')
./windrv.h:1119: error: extra brace group at end of initializer
./windrv.h:1119: error: (near initialization for `ndis_regvals[262]')
./windrv.h:1121: error: extra brace group at end of initializer
./windrv.h:1121: error: (near initialization for `ndis_regvals[262]')
./windrv.h:1122: error: extra brace group at end of initializer
./windrv.h:1122: error: (near initialization for `ndis_regvals[262]')
./windrv.h:1124: error: extra brace group at end of initializer
./windrv.h:1124: error: (near initialization for `ndis_regvals[262]')
./windrv.h:1125: error: extra brace group at end of initializer
./windrv.h:1125: error: (near initialization for `ndis_regvals[262]')
./windrv.h:1127: error: extra brace group at end of initializer
./windrv.h:1127: error: (near initialization for `ndis_regvals[262]')
./windrv.h:1128: error: extra brace group at end of initializer
./windrv.h:1128: error: (near initialization for `ndis_regvals[262]')
./windrv.h:1130: error: extra brace group at end of initializer
./windrv.h:1130: error: (near initialization for `ndis_regvals[262]')
./windrv.h:1131: error: extra brace group at end of initializer
./windrv.h:1131: error: (near initialization for `ndis_regvals[262]')
./windrv.h:1133: error: extra brace group at end of initializer
./windrv.h:1133: error: (near initialization for `ndis_regvals[262]')
./windrv.h:1134: error: extra brace group at end of initializer
./windrv.h:1134: error: (near initialization for `ndis_regvals[262]')
./windrv.h:1136: error: extra brace group at end of initializer
./windrv.h:1136: error: (near initialization for `ndis_regvals[262]')
./windrv.h:1137: error: extra brace group at end of initializer
./windrv.h:1137: error: (near initialization for `ndis_regvals[262]')
./windrv.h:1139: error: extra brace group at end of initializer
./windrv.h:1139: error: (near initialization for `ndis_regvals[262]')
./windrv.h:1140: error: extra brace group at end of initializer
./windrv.h:1140: error: (near initialization for `ndis_regvals[262]')
./windrv.h:1142: error: extra brace group at end of initializer
./windrv.h:1142: error: (near initialization for `ndis_regvals[262]')
./windrv.h:1143: error: extra brace group at end of initializer
./windrv.h:1143: error: (near initialization for `ndis_regvals[262]')
./windrv.h:1145: error: extra brace group at end of initializer
./windrv.h:1145: error: (near initialization for `ndis_regvals[262]')
./windrv.h:1146: error: extra brace group at end of initializer
./windrv.h:1146: error: (near initialization for `ndis_regvals[262]')
./windrv.h:1148: error: extra brace group at end of initializer
./windrv.h:1148: error: (near initialization for `ndis_regvals[262]')
./windrv.h:1149: error: extra brace group at end of initializer
./windrv.h:1149: error: (near initialization for `ndis_regvals[262]')
./windrv.h:1151: error: extra brace group at end of initializer
./windrv.h:1151: error: (near initialization for `ndis_regvals[262]')
./windrv.h:1152: error: extra brace group at end of initializer
./windrv.h:1152: error: (near initialization for `ndis_regvals[262]')
./windrv.h:1154: error: extra brace group at end of initializer
./windrv.h:1154: error: (near initialization for `ndis_regvals[262]')
./windrv.h:1155: error: extra brace group at end of initializer
./windrv.h:1155: error: (near initialization for `ndis_regvals[262]')
./windrv.h:1157: error: extra brace group at end of initializer
./windrv.h:1157: error: (near initialization for `ndis_regvals[262]')
./windrv.h:1158: error: extra brace group at end of initializer
./windrv.h:1158: error: (near initialization for `ndis_regvals[262]')
./windrv.h:1160: error: extra brace group at end of initializer
./windrv.h:1160: error: (near initialization for `ndis_regvals[262]')
./windrv.h:1161: error: extra brace group at end of initializer
./windrv.h:1161: error: (near initialization for `ndis_regvals[262]')
./windrv.h:1163: error: extra brace group at end of initializer
./windrv.h:1163: error: (near initialization for `ndis_regvals[262]')
./windrv.h:1164: error: extra brace group at end of initializer
./windrv.h:1164: error: (near initialization for `ndis_regvals[262]')
./windrv.h:1166: error: extra brace group at end of initializer
./windrv.h:1166: error: (near initialization for `ndis_regvals[262]')
./windrv.h:1167: error: extra brace group at end of initializer
./windrv.h:1167: error: (near initialization for `ndis_regvals[262]')
./windrv.h:1169: error: extra brace group at end of initializer
./windrv.h:1169: error: (near initialization for `ndis_regvals[262]')
./windrv.h:1170: error: extra brace group at end of initializer
./windrv.h:1170: error: (near initialization for `ndis_regvals[262]')
./windrv.h:1172: error: extra brace group at end of initializer
./windrv.h:1172: error: (near initialization for `ndis_regvals[262]')
./windrv.h:1173: error: extra brace group at end of initializer
./windrv.h:1173: error: (near initialization for `ndis_regvals[262]')
./windrv.h:1175: error: extra brace group at end of initializer
./windrv.h:1175: error: (near initialization for `ndis_regvals[262]')
./windrv.h:1176: error: extra brace group at end of initializer
./windrv.h:1176: error: (near initialization for `ndis_regvals[262]')
./windrv.h:1178: error: extra brace group at end of initializer
./windrv.h:1178: error: (near initialization for `ndis_regvals[262]')
./windrv.h:1179: error: extra brace group at end of initializer
./windrv.h:1179: error: (near initialization for `ndis_regvals[262]')
./windrv.h:1181: error: extra brace group at end of initializer
./windrv.h:1181: error: (near initialization for `ndis_regvals[262]')
./windrv.h:1182: error: extra brace group at end of initializer
./windrv.h:1182: error: (near initialization for `ndis_regvals[262]')
./windrv.h:1184: error: extra brace group at end of initializer
./windrv.h:1184: error: (near initialization for `ndis_regvals[262]')
./windrv.h:1185: error: extra brace group at end of initializer
./windrv.h:1185: error: (near initialization for `ndis_regvals[262]')
./windrv.h:1185: error: extra brace group at end of initializer
./windrv.h:1185: error: (near initialization for `ndis_regvals[262]')
./windrv.h:1186: warning: excess elements in struct initializer
./windrv.h:1186: warning: (near initialization for `ndis_regvals[262]')
./windrv.h:1186: error: syntax error before ';' token
/usr/share/misc/windrv_stub.c:74: error: elements of array `ndis_devs_pci' have incomplete type
/usr/share/misc/windrv_stub.c:75: warning: excess elements in struct initializer
/usr/share/misc/windrv_stub.c:75: warning: (near initialization for `ndis_devs_pci[0]')
/usr/share/misc/windrv_stub.c:75: warning: excess elements in struct initializer
/usr/share/misc/windrv_stub.c:75: warning: (near initialization for `ndis_devs_pci[0]')
/usr/share/misc/windrv_stub.c:75: warning: excess elements in struct initializer
/usr/share/misc/windrv_stub.c:75: warning: (near initialization for `ndis_devs_pci[0]')
/usr/share/misc/windrv_stub.c:75: warning: excess elements in struct initializer
/usr/share/misc/windrv_stub.c:75: warning: (near initialization for `ndis_devs_pci[0]')
/usr/share/misc/windrv_stub.c:75: warning: excess elements in struct initializer
/usr/share/misc/windrv_stub.c:75: warning: (near initialization for `ndis_devs_pci[1]')
/usr/share/misc/windrv_stub.c:75: warning: excess elements in struct initializer
/usr/share/misc/windrv_stub.c:75: warning: (near initialization for `ndis_devs_pci[1]')
/usr/share/misc/windrv_stub.c:75: warning: excess elements in struct initializer
/usr/share/misc/windrv_stub.c:75: warning: (near initialization for `ndis_devs_pci[1]')
/usr/share/misc/windrv_stub.c:75: warning: excess elements in struct initializer
/usr/share/misc/windrv_stub.c:75: warning: (near initialization for `ndis_devs_pci[1]')
/usr/share/misc/windrv_stub.c:75: warning: excess elements in struct initializer
/usr/share/misc/windrv_stub.c:75: warning: (near initialization for `ndis_devs_pci[2]')
/usr/share/misc/windrv_stub.c:75: warning: excess elements in struct initializer
/usr/share/misc/windrv_stub.c:75: warning: (near initialization for `ndis_devs_pci[2]')
/usr/share/misc/windrv_stub.c:75: warning: excess elements in struct initializer
/usr/share/misc/windrv_stub.c:75: warning: (near initialization for `ndis_devs_pci[2]')
/usr/share/misc/windrv_stub.c:75: warning: excess elements in struct initializer
/usr/share/misc/windrv_stub.c:75: warning: (near initialization for `ndis_devs_pci[2]')
/usr/share/misc/windrv_stub.c:75: warning: excess elements in struct initializer
/usr/share/misc/windrv_stub.c:75: warning: (near initialization for `ndis_devs_pci[3]')
/usr/share/misc/windrv_stub.c:75: warning: excess elements in struct initializer
/usr/share/misc/windrv_stub.c:75: warning: (near initialization for `ndis_devs_pci[3]')
/usr/share/misc/windrv_stub.c:75: warning: excess elements in struct initializer
/usr/share/misc/windrv_stub.c:75: warning: (near initialization for `ndis_devs_pci[3]')
/usr/share/misc/windrv_stub.c:75: warning: excess elements in struct initializer
/usr/share/misc/windrv_stub.c:75: warning: (near initialization for `ndis_devs_pci[3]')
/usr/share/misc/windrv_stub.c:75: warning: excess elements in struct initializer
/usr/share/misc/windrv_stub.c:75: warning: (near initialization for `ndis_devs_pci[4]')
/usr/share/misc/windrv_stub.c:75: warning: excess elements in struct initializer
/usr/share/misc/windrv_stub.c:75: warning: (near initialization for `ndis_devs_pci[4]')
/usr/share/misc/windrv_stub.c:75: warning: excess elements in struct initializer
/usr/share/misc/windrv_stub.c:75: warning: (near initialization for `ndis_devs_pci[4]')
/usr/share/misc/windrv_stub.c:75: warning: excess elements in struct initializer
/usr/share/misc/windrv_stub.c:75: warning: (near initialization for `ndis_devs_pci[4]')
/usr/share/misc/windrv_stub.c:75: warning: excess elements in struct initializer
/usr/share/misc/windrv_stub.c:75: warning: (near initialization for `ndis_devs_pci[5]')
/usr/share/misc/windrv_stub.c:75: warning: excess elements in struct initializer
/usr/share/misc/windrv_stub.c:75: warning: (near initialization for `ndis_devs_pci[5]')
/usr/share/misc/windrv_stub.c:75: warning: excess elements in struct initializer
/usr/share/misc/windrv_stub.c:75: warning: (near initialization for `ndis_devs_pci[5]')
/usr/share/misc/windrv_stub.c:75: warning: excess elements in struct initializer
/usr/share/misc/windrv_stub.c:75: warning: (near initialization for `ndis_devs_pci[5]')
/usr/share/misc/windrv_stub.c:75: warning: excess elements in struct initializer
/usr/share/misc/windrv_stub.c:75: warning: (near initialization for `ndis_devs_pci[6]')
/usr/share/misc/windrv_stub.c:75: warning: excess elements in struct initializer
/usr/share/misc/windrv_stub.c:75: warning: (near initialization for `ndis_devs_pci[6]')
/usr/share/misc/windrv_stub.c:75: warning: excess elements in struct initializer
/usr/share/misc/windrv_stub.c:75: warning: (near initialization for `ndis_devs_pci[6]')
/usr/share/misc/windrv_stub.c:75: warning: excess elements in struct initializer
/usr/share/misc/windrv_stub.c:75: warning: (near initialization for `ndis_devs_pci[6]')
/usr/share/misc/windrv_stub.c:75: warning: excess elements in struct initializer
/usr/share/misc/windrv_stub.c:75: warning: (near initialization for `ndis_devs_pci[7]')
/usr/share/misc/windrv_stub.c:75: warning: excess elements in struct initializer
/usr/share/misc/windrv_stub.c:75: warning: (near initialization for `ndis_devs_pci[7]')
/usr/share/misc/windrv_stub.c:75: warning: excess elements in struct initializer
/usr/share/misc/windrv_stub.c:75: warning: (near initialization for `ndis_devs_pci[7]')
/usr/share/misc/windrv_stub.c:75: warning: excess elements in struct initializer
/usr/share/misc/windrv_stub.c:75: warning: (near initialization for `ndis_devs_pci[7]')
/usr/share/misc/windrv_stub.c:76: warning: excess elements in struct initializer
/usr/share/misc/windrv_stub.c:76: warning: (near initialization for `ndis_devs_pci[8]')
/usr/share/misc/windrv_stub.c:76: warning: excess elements in struct initializer
/usr/share/misc/windrv_stub.c:76: warning: (near initialization for `ndis_devs_pci[8]')
/usr/share/misc/windrv_stub.c:76: warning: excess elements in struct initializer
/usr/share/misc/windrv_stub.c:76: warning: (near initialization for `ndis_devs_pci[8]')
/usr/share/misc/windrv_stub.c:76: warning: excess elements in struct initializer
/usr/share/misc/windrv_stub.c:76: warning: (near initialization for `ndis_devs_pci[8]')
/usr/share/misc/windrv_stub.c:81: error: elements of array `ndis_devs_pccard' have incomplete type
/usr/share/misc/windrv_stub.c:82: warning: excess elements in struct initializer
/usr/share/misc/windrv_stub.c:82: warning: (near initialization for `ndis_devs_pccard[0]')
/usr/share/misc/windrv_stub.c:82: warning: excess elements in struct initializer
/usr/share/misc/windrv_stub.c:82: warning: (near initialization for `ndis_devs_pccard[0]')
/usr/share/misc/windrv_stub.c:82: warning: excess elements in struct initializer
/usr/share/misc/windrv_stub.c:82: warning: (near initialization for `ndis_devs_pccard[0]')
/usr/share/misc/windrv_stub.c:82: warning: excess elements in struct initializer
/usr/share/misc/windrv_stub.c:82: warning: (near initialization for `ndis_devs_pccard[1]')
/usr/share/misc/windrv_stub.c:82: warning: excess elements in struct initializer
/usr/share/misc/windrv_stub.c:82: warning: (near initialization for `ndis_devs_pccard[1]')
/usr/share/misc/windrv_stub.c:82: warning: excess elements in struct initializer
/usr/share/misc/windrv_stub.c:82: warning: (near initialization for `ndis_devs_pccard[1]')
/usr/share/misc/windrv_stub.c:83: warning: excess elements in struct initializer
/usr/share/misc/windrv_stub.c:83: warning: (near initialization for `ndis_devs_pccard[2]')
/usr/share/misc/windrv_stub.c:83: warning: excess elements in struct initializer
/usr/share/misc/windrv_stub.c:83: warning: (near initialization for `ndis_devs_pccard[2]')
/usr/share/misc/windrv_stub.c:83: warning: excess elements in struct initializer
/usr/share/misc/windrv_stub.c:83: warning: (near initialization for `ndis_devs_pccard[2]')
build failed. Exiting.