rendered paste body| make[2]: Entering directory `/stuff/build/tmp/work/compulab-pxa270-angstrom-linux-gnueabi/compulab-pxa270-2.6.16-r2/linux-2.6.16'
| make[2]: Leaving directory `/stuff/build/tmp/work/compulab-pxa270-angstrom-linux-gnueabi/compulab-pxa270-2.6.16-r2/linux-2.6.16'
| make[2]: Entering directory `/stuff/build/tmp/work/compulab-pxa270-angstrom-linux-gnueabi/compulab-pxa270-2.6.16-r2/linux-2.6.16'
| make[3]: Entering directory `/stuff/build/tmp/work/compulab-pxa270-angstrom-linux-gnueabi/compulab-pxa270-2.6.16-r2/linux-2.6.16'
| LD drivers/block/cl_flash/fdrv.o
| arm-angstrom-linux-gnueabi-ld: ERROR: drivers/block/cl_flash/CL_FlashDrv uses FPA instructions, whereas drivers/block/cl_flash/fdrv.o does not
| arm-angstrom-linux-gnueabi-ld: failed to merge target specific data of file drivers/block/cl_flash/CL_FlashDrv
| make[2]: Entering directory `/stuff/build/tmp/work/compulab-pxa270-angstrom-linux-gnueabi/compulab-pxa270-2.6.16-r2/linux-2.6.16'
| make[2]: Leaving directory `/stuff/build/tmp/work/compulab-pxa270-angstrom-linux-gnueabi/compulab-pxa270-2.6.16-r2/linux-2.6.16'
| make[2]: Entering directory `/stuff/build/tmp/work/compulab-pxa270-angstrom-linux-gnueabi/compulab-pxa270-2.6.16-r2/linux-2.6.16'
| make[2]: Leaving directory `/stuff/build/tmp/work/compulab-pxa270-angstrom-linux-gnueabi/compulab-pxa270-2.6.16-r2/linux-2.6.16'
| make[2]: Entering directory `/stuff/build/tmp/work/compulab-pxa270-angstrom-linux-gnueabi/compulab-pxa270-2.6.16-r2/linux-2.6.16'
| make[2]: Leaving directory `/stuff/build/tmp/work/compulab-pxa270-angstrom-linux-gnueabi/compulab-pxa270-2.6.16-r2/linux-2.6.16'
| make[3]: *** [drivers/block/cl_flash/fdrv.o] Error 1
| make[3]: Leaving directory `/stuff/build/tmp/work/compulab-pxa270-angstrom-linux-gnueabi/compulab-pxa270-2.6.16-r2/linux-2.6.16'
| make[2]: *** [drivers/block/cl_flash] Error 2
| make[2]: Leaving directory `/stuff/build/tmp/work/compulab-pxa270-angstrom-linux-gnueabi/compulab-pxa270-2.6.16-r2/linux-2.6.16'
| make[1]: *** [drivers/block] Error 2
| make[1]: Leaving directory `/stuff/build/tmp/work/compulab-pxa270-angstrom-linux-gnueabi/compulab-pxa270-2.6.16-r2/linux-2.6.16'
| make: *** [drivers] Error 2
| make: *** Waiting for unfinished jobs....
| make[2]: Entering directory `/stuff/build/tmp/work/compulab-pxa270-angstrom-linux-gnueabi/compulab-pxa270-2.6.16-r2/linux-2.6.16'
| make[2]: Leaving directory `/stuff/build/tmp/work/compulab-pxa270-angstrom-linux-gnueabi/compulab-pxa270-2.6.16-r2/linux-2.6.16'
| make[2]: Entering directory `/stuff/build/tmp/work/compulab-pxa270-angstrom-linux-gnueabi/compulab-pxa270-2.6.16-r2/linux-2.6.16'
| make[2]: Leaving directory `/stuff/build/tmp/work/compulab-pxa270-angstrom-linux-gnueabi/compulab-pxa270-2.6.16-r2/linux-2.6.16'
| make[1]: Leaving directory `/stuff/build/tmp/work/compulab-pxa270-angstrom-linux-gnueabi/compulab-pxa270-2.6.16-r2/linux-2.6.16'
| FATAL: oe_runmake failed
NOTE: Task failed: /stuff/build/tmp/work/compulab-pxa270-angstrom-linux-gnueabi/compulab-pxa270-2.6.16-r2/temp/log.do_compile.20087
NOTE: package compulab-pxa270-2.6.16-r2: task do_compile: failed
ERROR: TaskFailed event exception, aborting
NOTE: package compulab-pxa270-2.6.16: failed
ERROR: Build of /stuff/org.openembedded.dev/packages/linux/compulab-pxa270_2.6.16.bb do_compile failed
ERROR: Task 0 (/stuff/org.openembedded.dev/packages/linux/compulab-pxa270_2.6.16.bb, do_compile) failed
ERROR: '/stuff/org.openembedded.dev/packages/linux/compulab-pxa270_2.6.16.bb' failed