All pastes #447881 Raw Edit

Stuff

public text v1 · immutable
·published 2007-04-19 10:57 UTC
rendered paste body

Owner@JONAS-9BB9C5CB4 ~/mplayer
$ make
make -C libvo libvo.a
make[1]: Entering directory `/home/Owner/mplayer/libvo'
make[1]: `libvo.a' is up to date.
make[1]: Leaving directory `/home/Owner/mplayer/libvo'
make -C libao2
make[1]: Entering directory `/home/Owner/mplayer/libao2'
make[1]: Nothing to be done for `libs'.
make[1]: Leaving directory `/home/Owner/mplayer/libao2'
make -C input
make[1]: Entering directory `/home/Owner/mplayer/input'
make[1]: Nothing to be done for `libs'.
make[1]: Leaving directory `/home/Owner/mplayer/input'
make -C vidix
make[1]: Entering directory `/home/Owner/mplayer/vidix'
gcc -I../libavcodec -I../libavformat -Wdeclaration-after-statement -I. -I.. -I../libavutil -O4 -march=athlon-xp -mtune=athlon-xp -pipe -ffast-math -fomit-frame-pointer -D_LARGEFILE_SOURCE -D_FILE_OFFSET_BITS=64 -D_LARGEFILE64_SOURCE    -c -o pm2_vid.o pm2_vid.c
pm2_vid.c: In function `pm2_config_playback':
pm2_vid.c:291: error: syntax error before "u_long"
pm2_vid.c:291: error: `u_char' undeclared (first use in this function)
pm2_vid.c:291: error: (Each undeclared identifier is reported only once
pm2_vid.c:291: error: for each function it appears in.)
pm2_vid.c:291: error: syntax error before ')' token
pm2_vid.c:292: error: syntax error before "u_long"
pm2_vid.c:292: error: syntax error before ')' token
pm2_vid.c:293: error: syntax error before "u_long"
pm2_vid.c:293: error: syntax error before ')' token
pm2_vid.c:294: error: syntax error before "u_long"
pm2_vid.c:294: error: syntax error before ')' token
pm2_vid.c:295: error: syntax error before "u_long"
pm2_vid.c:295: error: syntax error before ')' token
pm2_vid.c:296: error: syntax error before "u_long"
pm2_vid.c:296: error: syntax error before ')' token
pm2_vid.c:297: error: syntax error before "u_long"
pm2_vid.c:297: error: syntax error before ')' token
pm2_vid.c:299: error: syntax error before "u_long"
pm2_vid.c:299: error: syntax error before ')' token
pm2_vid.c:300: error: syntax error before "u_long"
pm2_vid.c:300: error: syntax error before ')' token
pm2_vid.c:302: error: syntax error before "u_long"
pm2_vid.c:302: error: syntax error before ')' token
pm2_vid.c:303: error: syntax error before "u_long"
pm2_vid.c:303: error: syntax error before ')' token
pm2_vid.c:304: error: syntax error before "u_long"
pm2_vid.c:304: error: syntax error before ')' token
pm2_vid.c:306: error: syntax error before "u_long"
pm2_vid.c:306: error: syntax error before ')' token
pm2_vid.c:307: error: syntax error before "u_long"
pm2_vid.c:307: error: syntax error before ')' token
pm2_vid.c:308: error: syntax error before "u_long"
pm2_vid.c:308: error: syntax error before ')' token
pm2_vid.c:309: error: syntax error before "u_long"
pm2_vid.c:309: error: syntax error before ')' token
pm2_vid.c:310: error: syntax error before "u_long"
pm2_vid.c:310: error: syntax error before ')' token
pm2_vid.c:311: error: syntax error before "u_long"
pm2_vid.c:311: error: syntax error before ')' token
pm2_vid.c:312: error: syntax error before "u_long"
pm2_vid.c:312: error: syntax error before ')' token
pm2_vid.c:313: error: syntax error before "u_long"
pm2_vid.c:313: error: syntax error before ')' token
pm2_vid.c:314: error: syntax error before "u_long"
pm2_vid.c:314: error: syntax error before ')' token
pm2_vid.c:316: error: syntax error before "u_long"
pm2_vid.c:316: error: syntax error before ')' token
pm2_vid.c:317: error: syntax error before "u_long"
pm2_vid.c:317: error: syntax error before ')' token
pm2_vid.c:319: error: syntax error before "u_long"
pm2_vid.c:319: error: syntax error before ')' token
pm2_vid.c:320: error: syntax error before "u_long"
pm2_vid.c:320: error: syntax error before ')' token
pm2_vid.c:321: error: syntax error before "u_long"
pm2_vid.c:321: error: syntax error before ')' token
pm2_vid.c:322: error: syntax error before "u_long"
pm2_vid.c:322: error: syntax error before ')' token
pm2_vid.c: In function `pm2_playback_off':
pm2_vid.c:338: error: syntax error before "u_long"
pm2_vid.c:338: error: `u_char' undeclared (first use in this function)
pm2_vid.c:338: error: syntax error before ')' token
pm2_vid.c:339: error: syntax error before "u_long"
pm2_vid.c:339: error: syntax error before ')' token
pm2_vid.c:340: error: syntax error before "u_long"
pm2_vid.c:340: error: syntax error before ')' token
pm2_vid.c:341: error: syntax error before "u_long"
pm2_vid.c:341: error: syntax error before ')' token
pm2_vid.c: In function `pm2_frame_select':
pm2_vid.c:347: error: syntax error before "u_long"
pm2_vid.c:347: error: `u_char' undeclared (first use in this function)
pm2_vid.c:347: error: syntax error before ')' token
pm2_vid.c:348: error: syntax error before "u_long"
pm2_vid.c:348: error: syntax error before ')' token
make[1]: *** [pm2_vid.o] Error 1
make[1]: Leaving directory `/home/Owner/mplayer/vidix'
make: *** [vidix/libvidix.a] Error 2

Owner@JONAS-9BB9C5CB4 ~/mplayer
$