gcc -DHAVE_CONFIG_H -I. -I. -I../.. -fno-strict-aliasing -DPACKAGE_DATA_DIR=\"/usr/local/share\" -DPACKAGE_LIB_DIR=\"/usr/local/lib\" -DPACKAGE_LOCALE_DIR=\"/usr/local/share/locale\" -I../../src -DORBIT2=1 -pthread -I/usr/include/gtk-2.0 -I/usr/lib/gtk-2.0/include -I/usr/include/atk-1.0 -I/usr/include/cairo -I/usr/include/pango-1.0 -I/usr/include/glib-2.0 -I/usr/lib/glib-2.0/include -I/usr/include/freetype2 -I/usr/include/libpng12 -I/usr/include/gconf/2 -I/usr/include/orbit-2.0 -I/usr/include/libxml2 -I/usr/include//lua50 -DORBIT2=1 -pthread -I/usr/include/gtk-2.0 -I/usr/lib/gtk-2.0/include -I/usr/include/atk-1.0 -I/usr/include/cairo -I/usr/include/pango-1.0 -I/usr/include/glib-2.0 -I/usr/lib/glib-2.0/include -I/usr/include/freetype2 -I/usr/include/libpng12 -I/usr/include/gconf/2 -I/usr/include/orbit-2.0 -I/usr/include/libxml2 -I/usr/include//lua50 -g -O2 -MT libliscrlua_la-lua.lo -MD -MP -MF .deps/libliscrlua_la-lua.Tpo -c lua.c -fPIC -DPIC -o .libs/libliscrlua_la-lua.o
In file included from lua.c:25:
liferea_wrap.h: In function '_wrap_node_needsCacheSave_set':
liferea_wrap.h:2179: error: 'struct node' has no member named 'needsCacheSave'
liferea_wrap.h: In function '_wrap_node_needsCacheSave_get':
liferea_wrap.h:2202: error: 'struct node' has no member named 'needsCacheSave'
liferea_wrap.h: In function '_wrap_node_itemSet_set':
liferea_wrap.h:2279: error: 'struct node' has no member named 'itemSet'
liferea_wrap.h: In function '_wrap_node_itemSet_get':
liferea_wrap.h:2302: error: 'struct node' has no member named 'itemSet'
liferea_wrap.h: In function '_wrap_item_comments_set':
liferea_wrap.h:5436: error: 'struct item' has no member named 'comments'
liferea_wrap.h: In function '_wrap_item_comments_get':
liferea_wrap.h:5459: error: 'struct item' has no member named 'comments'
liferea_wrap.h: In function '_wrap_item_updateRequest_set':
liferea_wrap.h:5487: error: 'struct item' has no member named 'updateRequest'
liferea_wrap.h: In function '_wrap_item_updateRequest_get':
liferea_wrap.h:5510: error: 'struct item' has no member named 'updateRequest'
liferea_wrap.h: In function '_wrap_item_updateState_set':
liferea_wrap.h:5538: error: 'struct item' has no member named 'updateState'
liferea_wrap.h: In function '_wrap_item_updateState_get':
liferea_wrap.h:5561: error: 'struct item' has no member named 'updateState'
liferea_wrap.h: In function '_wrap_item_commentsError_set':
liferea_wrap.h:5586: error: 'struct item' has no member named 'commentsError'
liferea_wrap.h:5586: error: 'struct item' has no member named 'commentsError'
liferea_wrap.h:5588: error: 'struct item' has no member named 'commentsError'
liferea_wrap.h:5589: error: 'struct item' has no member named 'commentsError'
liferea_wrap.h:5591: error: 'struct item' has no member named 'commentsError'
liferea_wrap.h: In function '_wrap_item_commentsError_get':
liferea_wrap.h:5615: error: 'struct item' has no member named 'commentsError'
liferea_wrap.h: In function '_wrap_item_itemSet_set':
liferea_wrap.h:5643: error: 'struct item' has no member named 'itemSet'
liferea_wrap.h: In function '_wrap_item_itemSet_get':
liferea_wrap.h:5666: error: 'struct item' has no member named 'itemSet'
liferea_wrap.h: In function '_wrap_item_node_set':
liferea_wrap.h:5694: error: 'struct item' has no member named 'node'
liferea_wrap.h: In function '_wrap_item_node_get':
liferea_wrap.h:5717: error: 'struct item' has no member named 'node'
liferea_wrap.h: In function '_wrap_item_to_xml':
liferea_wrap.h:6374: error: too many arguments to function 'item_to_xml'
liferea_wrap.h: In function '_wrap_itemlist_load':
liferea_wrap.h:6465: warning: passing argument 1 of 'itemlist_load' from incompatible pointer type
liferea_wrap.h: In function '_wrap_itemlist_remove_all_items':
liferea_wrap.h:6720: warning: passing argument 1 of 'itemlist_remove_all_items' from incompatible pointer type
liferea_wrap.h: In function '_wrap_itemlist_mark_all_read':
liferea_wrap.h:6743: warning: passing argument 1 of 'itemlist_mark_all_read' from incompatible pointer type
liferea_wrap.h: In function '_wrap_itemlist_mark_all_old':
liferea_wrap.h:6766: warning: passing argument 1 of 'itemlist_mark_all_old' from incompatible pointer type
liferea_wrap.h: In function '_wrap_itemlist_mark_all_popup':
liferea_wrap.h:6789: warning: passing argument 1 of 'itemlist_mark_all_popup' from incompatible pointer type
liferea_wrap.h: In function '_wrap_itemlist_update_vfolder':
liferea_wrap.h:6802: error: 'vfolderPtr' undeclared (first use in this function)
liferea_wrap.h:6802: error: (Each undeclared identifier is reported only once
liferea_wrap.h:6802: error: for each function it appears in.)
liferea_wrap.h:6802: error: expected ';' before 'arg1'
liferea_wrap.h:6803: error: 'argp1' undeclared (first use in this function)
liferea_wrap.h:6810: error: 'arg1' undeclared (first use in this function)
liferea_wrap.h: In function '_wrap_ui_data_row_set':
liferea_wrap.h:7728: error: 'ui_data' undeclared (first use in this function)
liferea_wrap.h:7728: error: 'arg1' undeclared (first use in this function)
liferea_wrap.h:7728: error: expected expression before ')' token
liferea_wrap.h: In function '_wrap_ui_data_row_get':
liferea_wrap.h:7759: error: 'ui_data' undeclared (first use in this function)
liferea_wrap.h:7759: error: 'arg1' undeclared (first use in this function)
liferea_wrap.h:7759: error: expected expression before ')' token
liferea_wrap.h: In function '_wrap_new_ui_data':
liferea_wrap.h:7786: error: 'ui_data' undeclared (first use in this function)
liferea_wrap.h:7786: error: 'result' undeclared (first use in this function)
liferea_wrap.h:7788: error: expected expression before ')' token
liferea_wrap.h:7788: error: expected ';' before 'calloc'
liferea_wrap.h: In function '_wrap_delete_ui_data':
liferea_wrap.h:7801: error: 'ui_data' undeclared (first use in this function)
liferea_wrap.h:7801: error: 'arg1' undeclared (first use in this function)
liferea_wrap.h:7801: error: expected expression before ')' token
liferea_wrap.h: In function 'swig_delete_ui_data':
liferea_wrap.h:7822: error: 'ui_data' undeclared (first use in this function)
liferea_wrap.h:7822: error: 'arg1' undeclared (first use in this function)
liferea_wrap.h:7822: error: expected expression before ')' token
liferea_wrap.h: In function '_wrap_ui_itemlist_find_unread_item':
liferea_wrap.h:8682: warning: passing argument 1 of 'ui_itemlist_find_unread_item' makes integer from pointer without a cast
liferea_wrap.h: In function '_wrap_ui_node_to_iter':
liferea_wrap.h:9334: warning: passing argument 1 of 'ui_node_to_iter' from incompatible pointer type
liferea_wrap.h: In function '_wrap_ui_node_update_iter':
liferea_wrap.h:9362: warning: passing argument 1 of 'ui_node_update_iter' from incompatible pointer type
liferea_wrap.h: In function '_wrap_ui_node_update':
liferea_wrap.h:9477: warning: passing argument 1 of 'ui_node_update' from incompatible pointer type
liferea_wrap.h: In function '_wrap_ui_node_is_folder_expanded':
liferea_wrap.h:9499: warning: passing argument 1 of 'ui_node_is_folder_expanded' from incompatible pointer type
liferea_wrap.h: In function '_wrap_ui_node_check_if_folder_is_empty':
liferea_wrap.h:9520: warning: passing argument 1 of 'ui_node_check_if_folder_is_empty' from incompatible pointer type
make[5]: *** [libliscrlua_la-lua.lo] Error 1
make[5]: Leaving directory `/home/emilio/Desktop/liferea-1.3.2/src/scripting'
make[4]: *** [all] Error 2
make[4]: Leaving directory `/home/emilio/Desktop/liferea-1.3.2/src/scripting'
make[3]: *** [all-recursive] Error 1
make[3]: Leaving directory `/home/emilio/Desktop/liferea-1.3.2/src'
make[2]: *** [all] Error 2
make[2]: Leaving directory `/home/emilio/Desktop/liferea-1.3.2/src'
make[1]: *** [all-recursive] Error 1
make[1]: Leaving directory `/home/emilio/Desktop/liferea-1.3.2'
make: *** [all] Error 2
emilio@kiko:~/Desktop/liferea-1.3.2$