gw zaptel # make
make -C /lib/modules/`uname -r`/build SUBDIRS=/usr/src/zaptel modules
make[1]: Entering directory `/usr/src/linux-2.6.10-gentoo-r4'
CC [M] /usr/src/zaptel/wcfxs.o
/usr/src/zaptel/wcfxs.c: In function `__check_battdebounce':
/usr/src/zaptel/wcfxs.c:2193: error: `battdebounce' undeclared (first use in this function)
/usr/src/zaptel/wcfxs.c:2193: error: (Each undeclared identifier is reported only once
/usr/src/zaptel/wcfxs.c:2193: error: for each function it appears in.)
/usr/src/zaptel/wcfxs.c: At top level:
/usr/src/zaptel/wcfxs.c:2193: error: `battdebounce' undeclared here (not in a function)
/usr/src/zaptel/wcfxs.c:2193: error: initializer element is not constant
/usr/src/zaptel/wcfxs.c:2193: error: (near initialization for `__param_battdebounce.arg')
/usr/src/zaptel/wcfxs.c: In function `__check_battthresh':
/usr/src/zaptel/wcfxs.c:2194: error: `battthresh' undeclared (first use in this function)
/usr/src/zaptel/wcfxs.c: At top level:
/usr/src/zaptel/wcfxs.c:2194: error: `battthresh' undeclared here (not in a function)
/usr/src/zaptel/wcfxs.c:2194: error: initializer element is not constant
/usr/src/zaptel/wcfxs.c:2194: error: (near initialization for `__param_battthresh.arg')
/usr/src/zaptel/wcfxs.c: In function `__check_alawoverride':
/usr/src/zaptel/wcfxs.c:2195: error: `alawoverride' undeclared (first use in this function)
/usr/src/zaptel/wcfxs.c: At top level:
/usr/src/zaptel/wcfxs.c:2195: error: `alawoverride' undeclared here (not in a function)
/usr/src/zaptel/wcfxs.c:2195: error: initializer element is not constant
/usr/src/zaptel/wcfxs.c:2195: error: (near initialization for `__param_alawoverride.arg')
/usr/src/zaptel/wcfxs.c:2193: error: __param_battdebounce causes a section type conflict
/usr/src/zaptel/wcfxs.c:2194: error: __param_battthresh causes a section type conflict
/usr/src/zaptel/wcfxs.c:2195: error: __param_alawoverride causes a section type conflict
make[2]: *** [/usr/src/zaptel/wcfxs.o] Error 1
make[1]: *** [_module_/usr/src/zaptel] Error 2
make[1]: Leaving directory `/usr/src/linux-2.6.10-gentoo-r4'
make: *** [linux26] Error 2