make[1]: se sale del directorio `/usr/src/linux-source-2.6.18'
/usr/bin/make EXTRAVERSION=-1-openvz ARCH=i386 prepare
make[1]: se ingresa al directorio `/usr/src/linux-source-2.6.18'
scripts/kconfig/conf -s arch/i386/Kconfig
make[1]: se sale del directorio `/usr/src/linux-source-2.6.18'
make[1]: se ingresa al directorio `/usr/src/linux-source-2.6.18'
CHK include/linux/version.h
CHK include/linux/utsrelease.h
make[1]: se sale del directorio `/usr/src/linux-source-2.6.18'
echo done > debian/stamp-kernel-conf
====== making target debian/stamp-build-kernel [new prereqs: sanity_check stamp-kernel-conf]======
This is kernel package version 10.067.
/usr/bin/make EXTRAVERSION=-1-openvz ARCH=i386 \
bzImage
make[1]: se ingresa al directorio `/usr/src/linux-source-2.6.18'
CHK include/linux/version.h
CHK include/linux/utsrelease.h
CHK include/linux/compile.h
CC kernel/sched.o
kernel/sched.c: In function __activate_task:
kernel/sched.c:1565: warning: implicit declaration of function ve_stop_idle
kernel/sched.c:1565: error: ve undeclared (first use in this function)
kernel/sched.c:1565: error: (Each undeclared identifier is reported only once
kernel/sched.c:1565: error: for each function it appears in.)
kernel/sched.c: In function deactivate_task:
kernel/sched.c:1718: error: pcpu undeclared (first use in this function)
kernel/sched.c:1735: warning: implicit declaration of function ve_strt_idle
kernel/sched.c:1735: error: ve undeclared (first use in this function)
kernel/sched.c:1735: error: cpu undeclared (first use in this function)
kernel/sched.c: In function pull_task:
kernel/sched.c:3037: error: ve undeclared (first use in this function)
kernel/sched.c: In function vsched_add_vcpu:
kernel/sched.c:8218: error: invalid application of sizeof to incomplete type struct ve_cpu_stats
kernel/sched.c:8218: warning: implicit declaration of function VE_CPU_STATS
kernel/sched.c:8218: error: struct fairsched_node has no member named owner_env
kernel/sched.c:8218: error: invalid application of sizeof to incomplete type struct ve_cpu_stats
kernel/sched.c:8218: warning: passing argument 1 of __constant_c_and_count_memset makes pointer from integer without a cast
kernel/sched.c:8218: error: struct fairsched_node has no member named owner_env
kernel/sched.c:8218: error: invalid application of sizeof to incomplete type struct ve_cpu_stats
kernel/sched.c:8218: warning: passing argument 1 of __constant_c_memset makes pointer from integer without a cast
kernel/sched.c:8218: error: invalid application of sizeof to incomplete type struct ve_cpu_stats
kernel/sched.c:8218: error: struct fairsched_node has no member named owner_env
kernel/sched.c:8218: error: invalid application of sizeof to incomplete type struct ve_cpu_stats
kernel/sched.c:8218: warning: passing argument 1 of __memset_generic makes pointer from integer without a cast
kernel/sched.c:8218: error: struct fairsched_node has no member named owner_env
kernel/sched.c:8218: error: invalid application of sizeof to incomplete type struct ve_cpu_stats
kernel/sched.c:8218: warning: passing argument 1 of __memset_generic makes pointer from integer without a cast
kernel/sched.c:8221: error: struct fairsched_node has no member named owner_env
make[2]: *** [kernel/sched.o] Error 1
make[1]: *** [kernel] Error 2
make[1]: se sale del directorio `/usr/src/linux-source-2.6.18'
make: *** [debian/stamp-build-kernel] Error 2
virtual:/usr/src/linux#