All pastes #44465 Raw Edit

Stuff

public text v1 · immutable
#44465 ·published 2006-03-04 17:26 UTC
rendered paste body
/bin/sh ../../libtool --silent --mode=link --tag=CXX i686-pc-linux-gnu-g++  -Wno-long-long -Wundef -ansi -D_XOPEN_SOURCE=500 -D_BSD_SOURCE -Wcast-align -Wconversion -Wchar-subscripts -Wall -W -Wpointer-arith -DNDEBUG -DNO_DEBUG -O2 -O2 -march=pentium-m -pipe -fno-inline -Wformat-security -Wmissing-format-attribute -Wno-non-virtual-dtor -fno-exceptions -fno-check-new -fno-common -DQT_CLEAN_NAMESPACE -DQT_NO_ASCII_CAST -DQT_NO_STL -DQT_NO_COMPAT -DQT_NO_TRANSLATION   -Wl,--as-needed -o amarokapp  main.o ../../amarok/src/amarokcore/libamarokcore.la libamarok.la ../../amarok/src/analyzers/libanalyzers.la ../../amarok/src/engine/libengine.la ../../amarok/src/plugin/libplugin.la ../../amarok/src/statusbar/libstatusbar.la ../../amarok/src/metadata/libmetadata.la -lkutils -lkio -lkdeui -lkdecore -lkhtml -lknewstuff -L/usr/lib -ltag -lGL  ../../amarok/src/sqlite/libsqlite.la
/usr/lib/libtag.so.1: undefined reference to `std::basic_string<wchar_t, std::char_traits<wchar_t>, std::allocator<wchar_t> >::find(wchar_t const*, unsigned int, unsigned int) const@GLIBCXX_3.4'
/usr/lib/libtag.so.1: undefined reference to `std::basic_string<wchar_t, std::char_traits<wchar_t>, std::allocator<wchar_t> >::assign(std::basic_string<wchar_t, std::char_traits<wchar_t>, std::allocator<wchar_t> > const&)@GLIBCXX_3.4'
/usr/lib/libtag.so.1: undefined reference to `std::basic_string<wchar_t, std::char_traits<wchar_t>, std::allocator<wchar_t> >::_Rep::_S_create(unsigned int, unsigned int, std::allocator<wchar_t> const&)@GLIBCXX_3.4'
/usr/lib/libtag.so.1: undefined reference to `std::basic_string<wchar_t, std::char_traits<wchar_t>, std::allocator<wchar_t> >::_M_mutate(unsigned int, unsigned int, unsigned int)@GLIBCXX_3.4'
/usr/lib/libtag.so.1: undefined reference to `std::basic_string<wchar_t, std::char_traits<wchar_t>, std::allocator<wchar_t> >::append(wchar_t const*, unsigned int)@GLIBCXX_3.4'
/usr/lib/libtag.so.1: undefined reference to `std::basic_string<wchar_t, std::char_traits<wchar_t>, std::allocator<wchar_t> >::resize(unsigned int, wchar_t)@GLIBCXX_3.4'
/usr/lib/libtag.so.1: undefined reference to `std::basic_string<wchar_t, std::char_traits<wchar_t>, std::allocator<wchar_t> >::basic_string(std::basic_string<wchar_t, std::char_traits<wchar_t>, std::allocator<wchar_t> > const&)@GLIBCXX_3.4'
/usr/lib/libtag.so.1: undefined reference to `std::basic_string<wchar_t, std::char_traits<wchar_t>, std::allocator<wchar_t> >::append(std::basic_string<wchar_t, std::char_traits<wchar_t>, std::allocator<wchar_t> > const&)@GLIBCXX_3.4'
/usr/lib/libtag.so.1: undefined reference to `std::basic_string<wchar_t, std::char_traits<wchar_t>, std::allocator<wchar_t> >::_Rep::_S_empty_rep_storage@GLIBCXX_3.4'
/usr/lib/libtag.so.1: undefined reference to `std::basic_string<wchar_t, std::char_traits<wchar_t>, std::allocator<wchar_t> >::basic_string(wchar_t const*, std::allocator<wchar_t> const&)@GLIBCXX_3.4'
/usr/lib/libtag.so.1: undefined reference to `std::basic_string<wchar_t, std::char_traits<wchar_t>, std::allocator<wchar_t> >::_M_leak_hard()@GLIBCXX_3.4'
/usr/lib/libtag.so.1: undefined reference to `std::basic_string<wchar_t, std::char_traits<wchar_t>, std::allocator<wchar_t> >::reserve(unsigned int)@GLIBCXX_3.4'
/usr/lib/libtag.so.1: undefined reference to `std::basic_string<wchar_t, std::char_traits<wchar_t>, std::allocator<wchar_t> >::basic_string(std::basic_string<wchar_t, std::char_traits<wchar_t>, std::allocator<wchar_t> > const&, unsigned int, unsigned int)@GLIBCXX_3.4'
/usr/lib/libtag.so.1: undefined reference to `std::basic_string<wchar_t, std::char_traits<wchar_t>, std::allocator<wchar_t> >::_Rep::_M_destroy(std::allocator<wchar_t> const&)@GLIBCXX_3.4'
collect2: ld returned 1 exit status
make[4]: *** [amarokapp] Error 1
make[4]: Leaving directory `/var/tmp/portage/amarok-1.4_beta1-r1/work/amarok-1.4-beta1/amarok/src'
make[3]: *** [all-recursive] Error 1
make[3]: Leaving directory `/var/tmp/portage/amarok-1.4_beta1-r1/work/amarok-1.4-beta1/amarok/src'
make[2]: *** [all-recursive] Error 1
make[2]: Leaving directory `/var/tmp/portage/amarok-1.4_beta1-r1/work/amarok-1.4-beta1/amarok'
make[1]: *** [all-recursive] Error 1
make[1]: Leaving directory `/var/tmp/portage/amarok-1.4_beta1-r1/work/amarok-1.4-beta1'
make: *** [all] Error 2