All pastes #44119 Raw Edit

kikidonk

public text v1 · immutable
#44119 ·published 2006-03-01 17:29 UTC
rendered paste body
This file contains any messages produced by compilers whilerunning configure, to aid debugging if configure makes a mistake.It was created by GNOME Web Browser configure 1.9.9, which wasgenerated by GNU Autoconf 2.59.  Invocation command line was  $ ./configure --enable-maintainer-mode --prefix /home/kikidonk/Devel/gnome-install --disable-static --disable-docs --disable-gtk-docs --with-mozilla=firefox --enable-dbus --enable-debug --enable-maintainer-mode --enable-compile-warnings=error## --------- #### Platform. #### --------- ##hostname = arschlorduname -m = i686uname -r = 2.6.15-16-686uname -s = Linuxuname -v = #1 SMP PREEMPT Mon Feb 20 17:26:04 UTC 2006/usr/bin/uname -p = unknown/bin/uname -X     = unknown/bin/arch              = i686/usr/bin/arch -k       = unknown/usr/convex/getsysinfo = unknownhostinfo               = unknown/bin/machine           = unknown/usr/bin/oslevel       = unknown/bin/universe          = unknownPATH: /home/kikidonk/Devel/gnome-install/binPATH: /home/kikidonk/Devel/binPATH: /usr/local/sbinPATH: /usr/local/binPATH: /usr/sbinPATH: /usr/binPATH: /sbinPATH: /binPATH: /usr/bin/X11PATH: /usr/gamesPATH: /opt/bin## ----------- #### Core tests. #### ----------- ##configure:1699: checking for a BSD-compatible installconfigure:1754: result: /home/kikidonk/Devel/bin/install-checkconfigure:1765: checking whether build environment is saneconfigure:1808: result: yesconfigure:1873: checking for gawkconfigure:1889: found /usr/bin/gawkconfigure:1899: result: gawkconfigure:1909: checking whether make sets $(MAKE)configure:1929: result: yesconfigure:2098: checking whether to enable maintainer-specific portions of Makefilesconfigure:2107: result: yesconfigure:2204: checking build system typeconfigure:2222: result: i686-pc-linux-gnuconfigure:2230: checking host system typeconfigure:2244: result: i686-pc-linux-gnuconfigure:2264: checking for style of include used by makeconfigure:2292: result: GNUconfigure:2363: checking for gccconfigure:2379: found /usr/bin/gccconfigure:2389: result: gccconfigure:2633: checking for C compiler versionconfigure:2636: gcc --version </dev/null >&5gcc (GCC) 4.0.3 20060212 (prerelease) (Ubuntu 4.0.2-9ubuntu1)Copyright (C) 2006 Free Software Foundation, Inc.This is free software; see the source for copying conditions.  There is NOwarranty; not even for MERCHANTABILITY or FITNESS FOR A PARTICULAR PURPOSE.configure:2639: $? = 0configure:2641: gcc -v </dev/null >&5Using built-in specs.Target: i486-linux-gnuConfigured with: ../src/configure -v --enable-languages=c,c++,java,f95,objc,ada,treelang --prefix=/usr --enable-shared --with-system-zlib --libexecdir=/usr/lib --without-included-gettext --enable-threads=posix --enable-nls --program-suffix=-4.0 --enable-__cxa_atexit --enable-clocale=gnu --enable-libstdcxx-debug --enable-java-awt=gtk-default --enable-gtk-cairo --with-java-home=/usr/lib/jvm/java-1.4.2-gcj-4.0-1.4.2.0/jre --enable-mpfr --disable-werror --with-tune=pentium4 --enable-checking=release i486-linux-gnuThread model: posixgcc version 4.0.3 20060212 (prerelease) (Ubuntu 4.0.2-9ubuntu1)configure:2644: $? = 0configure:2646: gcc -V </dev/null >&5gcc: '-V' option must have argumentconfigure:2649: $? = 1configure:2672: checking for C compiler default output file nameconfigure:2675: gcc -g   conftest.c  >&5configure:2678: $? = 0configure:2724: result: a.outconfigure:2729: checking whether the C compiler worksconfigure:2735: ./a.outconfigure:2738: $? = 0configure:2755: result: yesconfigure:2762: checking whether we are cross compilingconfigure:2764: result: noconfigure:2767: checking for suffix of executablesconfigure:2769: gcc -o conftest -g   conftest.c  >&5configure:2772: $? = 0configure:2797: result: configure:2803: checking for suffix of object filesconfigure:2824: gcc -c -g  conftest.c >&5configure:2827: $? = 0configure:2849: result: oconfigure:2853: checking whether we are using the GNU C compilerconfigure:2877: gcc -c -g  conftest.c >&5configure:2883: $? = 0configure:2887: test -z 			 || test ! -s conftest.errconfigure:2890: $? = 0configure:2893: test -s conftest.oconfigure:2896: $? = 0configure:2909: result: yesconfigure:2915: checking whether gcc accepts -gconfigure:2936: gcc -c -g  conftest.c >&5configure:2942: $? = 0configure:2946: test -z 			 || test ! -s conftest.errconfigure:2949: $? = 0configure:2952: test -s conftest.oconfigure:2955: $? = 0configure:2966: result: yesconfigure:2983: checking for gcc option to accept ANSI Cconfigure:3053: gcc  -c -g  conftest.c >&5configure:3059: $? = 0configure:3063: test -z 			 || test ! -s conftest.errconfigure:3066: $? = 0configure:3069: test -s conftest.oconfigure:3072: $? = 0configure:3090: result: none neededconfigure:3108: gcc -c -g  conftest.c >&5conftest.c:2: error: syntax error before 'me'configure:3114: $? = 1configure: failed program was:| #ifndef __cplusplus|   choke me| #endifconfigure:3249: checking dependency style of gccconfigure:3339: result: gcc3configure:3356: checking for a sed that does not truncate outputconfigure:3410: result: /bin/sedconfigure:3413: checking for egrepconfigure:3423: result: grep -Econfigure:3439: checking for ld used by gccconfigure:3506: result: /usr/bin/ldconfigure:3515: checking if the linker (/usr/bin/ld) is GNU ldconfigure:3530: result: yesconfigure:3535: checking for /usr/bin/ld option to reload object filesconfigure:3542: result: -rconfigure:3560: checking for BSD-compatible nmconfigure:3602: result: /usr/bin/nm -Bconfigure:3606: checking whether ln -s worksconfigure:3610: result: yesconfigure:3617: checking how to recognise dependent librariesconfigure:3789: result: pass_allconfigure:4003: checking how to run the C preprocessorconfigure:4038: gcc -E  conftest.cconfigure:4044: $? = 0configure:4076: gcc -E  conftest.cconftest.c:11:28: error: ac_nonexistent.h: No such file or directoryconfigure:4082: $? = 1configure: failed program was:| /* confdefs.h.  */| | #define PACKAGE_NAME "GNOME Web Browser"| #define PACKAGE_TARNAME "epiphany"| #define PACKAGE_VERSION "1.9.9"| #define PACKAGE_STRING "GNOME Web Browser 1.9.9"| #define PACKAGE_BUGREPORT "http://bugzilla.gnome.org/enter_bug.cgi?product=epiphany"| #define PACKAGE "epiphany"| #define VERSION "1.9.9"| /* end confdefs.h.  */| #include <ac_nonexistent.h>configure:4121: result: gcc -Econfigure:4145: gcc -E  conftest.cconfigure:4151: $? = 0configure:4183: gcc -E  conftest.cconftest.c:11:28: error: ac_nonexistent.h: No such file or directoryconfigure:4189: $? = 1configure: failed program was:| /* confdefs.h.  */| | #define PACKAGE_NAME "GNOME Web Browser"| #define PACKAGE_TARNAME "epiphany"| #define PACKAGE_VERSION "1.9.9"| #define PACKAGE_STRING "GNOME Web Browser 1.9.9"| #define PACKAGE_BUGREPORT "http://bugzilla.gnome.org/enter_bug.cgi?product=epiphany"| #define PACKAGE "epiphany"| #define VERSION "1.9.9"| /* end confdefs.h.  */| #include <ac_nonexistent.h>configure:4233: checking for ANSI C header filesconfigure:4258: gcc -c -g  conftest.c >&5configure:4264: $? = 0configure:4268: test -z 			 || test ! -s conftest.errconfigure:4271: $? = 0configure:4274: test -s conftest.oconfigure:4277: $? = 0configure:4366: gcc -o conftest -g   conftest.c  >&5conftest.c: In function 'main':conftest.c:28: warning: incompatible implicit declaration of built-in function 'exit'configure:4369: $? = 0configure:4371: ./conftestconfigure:4374: $? = 0configure:4389: result: yesconfigure:4413: checking for sys/types.hconfigure:4429: gcc -c -g  conftest.c >&5configure:4435: $? = 0configure:4439: test -z 			 || test ! -s conftest.errconfigure:4442: $? = 0configure:4445: test -s conftest.oconfigure:4448: $? = 0configure:4459: result: yesconfigure:4413: checking for sys/stat.hconfigure:4429: gcc -c -g  conftest.c >&5configure:4435: $? = 0configure:4439: test -z 			 || test ! -s conftest.errconfigure:4442: $? = 0configure:4445: test -s conftest.oconfigure:4448: $? = 0configure:4459: result: yesconfigure:4413: checking for stdlib.hconfigure:4429: gcc -c -g  conftest.c >&5configure:4435: $? = 0configure:4439: test -z 			 || test ! -s conftest.errconfigure:4442: $? = 0configure:4445: test -s conftest.oconfigure:4448: $? = 0configure:4459: result: yesconfigure:4413: checking for string.hconfigure:4429: gcc -c -g  conftest.c >&5configure:4435: $? = 0configure:4439: test -z 			 || test ! -s conftest.errconfigure:4442: $? = 0configure:4445: test -s conftest.oconfigure:4448: $? = 0configure:4459: result: yesconfigure:4413: checking for memory.hconfigure:4429: gcc -c -g  conftest.c >&5configure:4435: $? = 0configure:4439: test -z 			 || test ! -s conftest.errconfigure:4442: $? = 0configure:4445: test -s conftest.oconfigure:4448: $? = 0configure:4459: result: yesconfigure:4413: checking for strings.hconfigure:4429: gcc -c -g  conftest.c >&5configure:4435: $? = 0configure:4439: test -z 			 || test ! -s conftest.errconfigure:4442: $? = 0configure:4445: test -s conftest.oconfigure:4448: $? = 0configure:4459: result: yesconfigure:4413: checking for inttypes.hconfigure:4429: gcc -c -g  conftest.c >&5configure:4435: $? = 0configure:4439: test -z 			 || test ! -s conftest.errconfigure:4442: $? = 0configure:4445: test -s conftest.oconfigure:4448: $? = 0configure:4459: result: yesconfigure:4413: checking for stdint.hconfigure:4429: gcc -c -g  conftest.c >&5configure:4435: $? = 0configure:4439: test -z 			 || test ! -s conftest.errconfigure:4442: $? = 0configure:4445: test -s conftest.oconfigure:4448: $? = 0configure:4459: result: yesconfigure:4413: checking for unistd.hconfigure:4429: gcc -c -g  conftest.c >&5configure:4435: $? = 0configure:4439: test -z 			 || test ! -s conftest.errconfigure:4442: $? = 0configure:4445: test -s conftest.oconfigure:4448: $? = 0configure:4459: result: yesconfigure:4485: checking dlfcn.h usabilityconfigure:4497: gcc -c -g  conftest.c >&5configure:4503: $? = 0configure:4507: test -z 			 || test ! -s conftest.errconfigure:4510: $? = 0configure:4513: test -s conftest.oconfigure:4516: $? = 0configure:4526: result: yesconfigure:4530: checking dlfcn.h presenceconfigure:4540: gcc -E  conftest.cconfigure:4546: $? = 0configure:4566: result: yesconfigure:4601: checking for dlfcn.hconfigure:4608: result: yesconfigure:4673: checking for g++configure:4689: found /usr/bin/g++configure:4699: result: g++configure:4715: checking for C++ compiler versionconfigure:4718: g++ --version </dev/null >&5g++ (GCC) 4.0.3 20060212 (prerelease) (Ubuntu 4.0.2-9ubuntu1)Copyright (C) 2006 Free Software Foundation, Inc.This is free software; see the source for copying conditions.  There is NOwarranty; not even for MERCHANTABILITY or FITNESS FOR A PARTICULAR PURPOSE.configure:4721: $? = 0configure:4723: g++ -v </dev/null >&5Using built-in specs.Target: i486-linux-gnuConfigured with: ../src/configure -v --enable-languages=c,c++,java,f95,objc,ada,treelang --prefix=/usr --enable-shared --with-system-zlib --libexecdir=/usr/lib --without-included-gettext --enable-threads=posix --enable-nls --program-suffix=-4.0 --enable-__cxa_atexit --enable-clocale=gnu --enable-libstdcxx-debug --enable-java-awt=gtk-default --enable-gtk-cairo --with-java-home=/usr/lib/jvm/java-1.4.2-gcj-4.0-1.4.2.0/jre --enable-mpfr --disable-werror --with-tune=pentium4 --enable-checking=release i486-linux-gnuThread model: posixgcc version 4.0.3 20060212 (prerelease) (Ubuntu 4.0.2-9ubuntu1)configure:4726: $? = 0configure:4728: g++ -V </dev/null >&5g++: '-V' option must have argumentconfigure:4731: $? = 1configure:4734: checking whether we are using the GNU C++ compilerconfigure:4758: g++ -c   conftest.cc >&5configure:4764: $? = 0configure:4768: test -z 			 || test ! -s conftest.errconfigure:4771: $? = 0configure:4774: test -s conftest.oconfigure:4777: $? = 0configure:4790: result: yesconfigure:4796: checking whether g++ accepts -gconfigure:4817: g++ -c -g  conftest.cc >&5configure:4823: $? = 0configure:4827: test -z 			 || test ! -s conftest.errconfigure:4830: $? = 0configure:4833: test -s conftest.oconfigure:4836: $? = 0configure:4847: result: yesconfigure:4889: g++ -c -g -O2  conftest.cc >&5configure:4895: $? = 0configure:4899: test -z 			 || test ! -s conftest.errconfigure:4902: $? = 0configure:4905: test -s conftest.oconfigure:4908: $? = 0configure:4934: g++ -c -g -O2  conftest.cc >&5conftest.cc: In function 'int main()':conftest.cc:26: error: 'exit' was not declared in this scopeconfigure:4940: $? = 1configure: failed program was:| /* confdefs.h.  */| | #define PACKAGE_NAME "GNOME Web Browser"| #define PACKAGE_TARNAME "epiphany"| #define PACKAGE_VERSION "1.9.9"| #define PACKAGE_STRING "GNOME Web Browser 1.9.9"| #define PACKAGE_BUGREPORT "http://bugzilla.gnome.org/enter_bug.cgi?product=epiphany"| #define PACKAGE "epiphany"| #define VERSION "1.9.9"| #define STDC_HEADERS 1| #define HAVE_SYS_TYPES_H 1| #define HAVE_SYS_STAT_H 1| #define HAVE_STDLIB_H 1| #define HAVE_STRING_H 1| #define HAVE_MEMORY_H 1| #define HAVE_STRINGS_H 1| #define HAVE_INTTYPES_H 1| #define HAVE_STDINT_H 1| #define HAVE_UNISTD_H 1| #define HAVE_DLFCN_H 1| /* end confdefs.h.  */| | int| main ()| {| exit (42);|   ;|   return 0;| }configure:4889: g++ -c -g -O2  conftest.cc >&5configure:4895: $? = 0configure:4899: test -z 			 || test ! -s conftest.errconfigure:4902: $? = 0configure:4905: test -s conftest.oconfigure:4908: $? = 0configure:4934: g++ -c -g -O2  conftest.cc >&5configure:4940: $? = 0configure:4944: test -z 			 || test ! -s conftest.errconfigure:4947: $? = 0configure:4950: test -s conftest.oconfigure:4953: $? = 0configure:4978: checking dependency style of g++configure:5068: result: gcc3configure:5095: checking how to run the C++ preprocessorconfigure:5126: g++ -E  conftest.ccconfigure:5132: $? = 0configure:5164: g++ -E  conftest.ccconftest.cc:25:28: error: ac_nonexistent.h: No such file or directoryconfigure:5170: $? = 1configure: failed program was:| /* confdefs.h.  */| | #define PACKAGE_NAME "GNOME Web Browser"| #define PACKAGE_TARNAME "epiphany"| #define PACKAGE_VERSION "1.9.9"| #define PACKAGE_STRING "GNOME Web Browser 1.9.9"| #define PACKAGE_BUGREPORT "http://bugzilla.gnome.org/enter_bug.cgi?product=epiphany"| #define PACKAGE "epiphany"| #define VERSION "1.9.9"| #define STDC_HEADERS 1| #define HAVE_SYS_TYPES_H 1| #define HAVE_SYS_STAT_H 1| #define HAVE_STDLIB_H 1| #define HAVE_STRING_H 1| #define HAVE_MEMORY_H 1| #define HAVE_STRINGS_H 1| #define HAVE_INTTYPES_H 1| #define HAVE_STDINT_H 1| #define HAVE_UNISTD_H 1| #define HAVE_DLFCN_H 1| #ifdef __cplusplus| extern "C" void std::exit (int) throw (); using std::exit;| #endif| /* end confdefs.h.  */| #include <ac_nonexistent.h>configure:5209: result: g++ -Econfigure:5233: g++ -E  conftest.ccconfigure:5239: $? = 0configure:5271: g++ -E  conftest.ccconftest.cc:25:28: error: ac_nonexistent.h: No such file or directoryconfigure:5277: $? = 1configure: failed program was:| /* confdefs.h.  */| | #define PACKAGE_NAME "GNOME Web Browser"| #define PACKAGE_TARNAME "epiphany"| #define PACKAGE_VERSION "1.9.9"| #define PACKAGE_STRING "GNOME Web Browser 1.9.9"| #define PACKAGE_BUGREPORT "http://bugzilla.gnome.org/enter_bug.cgi?product=epiphany"| #define PACKAGE "epiphany"| #define VERSION "1.9.9"| #define STDC_HEADERS 1| #define HAVE_SYS_TYPES_H 1| #define HAVE_SYS_STAT_H 1| #define HAVE_STDLIB_H 1| #define HAVE_STRING_H 1| #define HAVE_MEMORY_H 1| #define HAVE_STRINGS_H 1| #define HAVE_INTTYPES_H 1| #define HAVE_STDINT_H 1| #define HAVE_UNISTD_H 1| #define HAVE_DLFCN_H 1| #ifdef __cplusplus| extern "C" void std::exit (int) throw (); using std::exit;| #endif| /* end confdefs.h.  */| #include <ac_nonexistent.h>configure:5374: checking for g77configure:5403: result: noconfigure:5374: checking for f77configure:5403: result: noconfigure:5374: checking for xlfconfigure:5403: result: noconfigure:5374: checking for frtconfigure:5403: result: noconfigure:5374: checking for pgf77configure:5403: result: noconfigure:5374: checking for fort77configure:5403: result: noconfigure:5374: checking for fl32configure:5403: result: noconfigure:5374: checking for af77configure:5403: result: noconfigure:5374: checking for f90configure:5403: result: noconfigure:5374: checking for xlf90configure:5403: result: noconfigure:5374: checking for pgf90configure:5403: result: noconfigure:5374: checking for epcf90configure:5403: result: noconfigure:5374: checking for f95configure:5403: result: noconfigure:5374: checking for fortconfigure:5403: result: noconfigure:5374: checking for xlf95configure:5403: result: noconfigure:5374: checking for ifcconfigure:5403: result: noconfigure:5374: checking for efcconfigure:5403: result: noconfigure:5374: checking for pgf95configure:5403: result: noconfigure:5374: checking for lf95configure:5403: result: noconfigure:5374: checking for gfortranconfigure:5403: result: noconfigure:5415: checking for Fortran 77 compiler versionconfigure:5418:  --version </dev/null >&5./configure: line 5419: --version: command not foundconfigure:5421: $? = 127configure:5423:  -v </dev/null >&5./configure: line 5424: -v: command not foundconfigure:5426: $? = 127configure:5428:  -V </dev/null >&5./configure: line 5429: -V: command not foundconfigure:5431: $? = 127configure:5439: checking whether we are using the GNU Fortran 77 compilerconfigure:5453:  -c  conftest.F >&5./configure: line 5454: -c: command not foundconfigure:5459: $? = 127configure: failed program was:|       program main| #ifndef __GNUC__|        choke me| #endif| |       endconfigure:5485: result: noconfigure:5491: checking whether  accepts -gconfigure:5503:  -c -g conftest.f >&5./configure: line 5504: -c: command not foundconfigure:5509: $? = 127configure: failed program was:|       program main| |       endconfigure:5534: result: noconfigure:5564: checking the maximum length of command line argumentsconfigure:5656: result: 32768configure:5667: checking command to parse /usr/bin/nm -B output from gcc objectconfigure:5763: gcc -c -g  conftest.c >&5configure:5766: $? = 0configure:5770: /usr/bin/nm -B conftest.o \| sed -n -e 's/^.*[ 	]\([ABCDGIRSTW][ABCDGIRSTW]*\)[ 	][ 	]*\([_A-Za-z][_A-Za-z0-9]*\)$/\1 \2 \2/p' \> conftest.nmconfigure:5773: $? = 0configure:5825: gcc -o conftest -g   conftest.c conftstm.o >&5configure:5828: $? = 0configure:5866: result: okconfigure:5870: checking for objdirconfigure:5885: result: .libsconfigure:5975: checking for arconfigure:5991: found /usr/bin/arconfigure:6002: result: arconfigure:6055: checking for ranlibconfigure:6071: found /usr/bin/ranlibconfigure:6082: result: ranlibconfigure:6135: checking for stripconfigure:6151: found /usr/bin/stripconfigure:6162: result: stripconfigure:6449: checking if gcc static flag  worksconfigure:6477: result: yesconfigure:6495: checking if gcc supports -fno-rtti -fno-exceptionsconfigure:6513: gcc -c -g  -fno-rtti -fno-exceptions conftest.c >&5cc1: warning: command line option "-fno-rtti" is valid for C++/ObjC++ but not for Cconfigure:6517: $? = 0configure:6530: result: noconfigure:6545: checking for gcc option to produce PICconfigure:6749: result: -fPICconfigure:6757: checking if gcc PIC flag -fPIC worksconfigure:6775: gcc -c -g  -fPIC -DPIC conftest.c >&5configure:6779: $? = 0configure:6792: result: yesconfigure:6816: checking if gcc supports -c -o file.oconfigure:6837: gcc -c -g  -o out/conftest2.o conftest.c >&5configure:6841: $? = 0configure:6863: result: yesconfigure:6889: checking whether the gcc linker (/usr/bin/ld) supports shared librariesconfigure:7785: result: yesconfigure:7811: checking whether -lc should be explicitly linked inconfigure:7816: gcc -c -g  conftest.c >&5configure:7819: $? = 0configure:7833: gcc -shared conftest.o  -v -Wl,-soname -Wl,conftest -o conftest 2\>\&1 \| grep  -lc  \>/dev/null 2\>\&1configure:7836: $? = 0configure:7848: result: noconfigure:7856: checking dynamic linker characteristicsconfigure:8423: result: GNU/Linux ld.soconfigure:8427: checking how to hardcode library paths into programsconfigure:8452: result: immediateconfigure:8466: checking whether stripping libraries is possibleconfigure:8471: result: yesconfigure:8597: checking for shl_loadconfigure:8654: gcc -o conftest -g   conftest.c  >&5/tmp/ccSzXVal.o: In function `main':/home/kikidonk/Devel/gnome/epiphany/conftest.c:65: undefined reference to `shl_load'/tmp/ccSzXVal.o:(.data+0x0): undefined reference to `shl_load'collect2: ld returned 1 exit statusconfigure:8660: $? = 1configure: failed program was:| /* confdefs.h.  */| | #define PACKAGE_NAME "GNOME Web Browser"| #define PACKAGE_TARNAME "epiphany"| #define PACKAGE_VERSION "1.9.9"| #define PACKAGE_STRING "GNOME Web Browser 1.9.9"| #define PACKAGE_BUGREPORT "http://bugzilla.gnome.org/enter_bug.cgi?product=epiphany"| #define PACKAGE "epiphany"| #define VERSION "1.9.9"| #define STDC_HEADERS 1| #define HAVE_SYS_TYPES_H 1| #define HAVE_SYS_STAT_H 1| #define HAVE_STDLIB_H 1| #define HAVE_STRING_H 1| #define HAVE_MEMORY_H 1| #define HAVE_STRINGS_H 1| #define HAVE_INTTYPES_H 1| #define HAVE_STDINT_H 1| #define HAVE_UNISTD_H 1| #define HAVE_DLFCN_H 1| #ifdef __cplusplus| extern "C" void std::exit (int) throw (); using std::exit;| #endif| /* end confdefs.h.  */| /* Define shl_load to an innocuous variant, in case <limits.h> declares shl_load.|    For example, HP-UX 11i <limits.h> declares gettimeofday.  */| #define shl_load innocuous_shl_load| | /* System header to define __stub macros and hopefully few prototypes,|     which can conflict with char shl_load (); below.|     Prefer <limits.h> to <assert.h> if __STDC__ is defined, since|     <limits.h> exists even on freestanding compilers.  */| | #ifdef __STDC__| # include <limits.h>| #else| # include <assert.h>| #endif| | #undef shl_load| | /* Override any gcc2 internal prototype to avoid an error.  */| #ifdef __cplusplus| extern "C"| {| #endif| /* We use char because int might match the return type of a gcc2|    builtin and then its argument prototype would still apply.  */| char shl_load ();| /* The GNU C library defines this for functions which it implements|     to always fail with ENOSYS.  Some functions are actually named|     something starting with __ and the normal name is an alias.  */| #if defined (__stub_shl_load) || defined (__stub___shl_load)| choke me| #else| char (*f) () = shl_load;| #endif| #ifdef __cplusplus| }| #endif| | int| main ()| {| return f != shl_load;|   ;|   return 0;| }configure:8685: result: noconfigure:8690: checking for shl_load in -ldldconfigure:8720: gcc -o conftest -g   conftest.c -ldld   >&5/usr/bin/ld: cannot find -ldldcollect2: ld returned 1 exit statusconfigure:8726: $? = 1configure: failed program was:| /* confdefs.h.  */| | #define PACKAGE_NAME "GNOME Web Browser"| #define PACKAGE_TARNAME "epiphany"| #define PACKAGE_VERSION "1.9.9"| #define PACKAGE_STRING "GNOME Web Browser 1.9.9"| #define PACKAGE_BUGREPORT "http://bugzilla.gnome.org/enter_bug.cgi?product=epiphany"| #define PACKAGE "epiphany"| #define VERSION "1.9.9"| #define STDC_HEADERS 1| #define HAVE_SYS_TYPES_H 1| #define HAVE_SYS_STAT_H 1| #define HAVE_STDLIB_H 1| #define HAVE_STRING_H 1| #define HAVE_MEMORY_H 1| #define HAVE_STRINGS_H 1| #define HAVE_INTTYPES_H 1| #define HAVE_STDINT_H 1| #define HAVE_UNISTD_H 1| #define HAVE_DLFCN_H 1| #ifdef __cplusplus| extern "C" void std::exit (int) throw (); using std::exit;| #endif| /* end confdefs.h.  */| | /* Override any gcc2 internal prototype to avoid an error.  */| #ifdef __cplusplus| extern "C"| #endif| /* We use char because int might match the return type of a gcc2|    builtin and then its argument prototype would still apply.  */| char shl_load ();| int| main ()| {| shl_load ();|   ;|   return 0;| }configure:8752: result: noconfigure:8757: checking for dlopenconfigure:8814: gcc -o conftest -g   conftest.c  >&5/tmp/ccIYLOrA.o: In function `main':/home/kikidonk/Devel/gnome/epiphany/conftest.c:65: undefined reference to `dlopen'/tmp/ccIYLOrA.o:(.data+0x0): undefined reference to `dlopen'collect2: ld returned 1 exit statusconfigure:8820: $? = 1configure: failed program was:| /* confdefs.h.  */| | #define PACKAGE_NAME "GNOME Web Browser"| #define PACKAGE_TARNAME "epiphany"| #define PACKAGE_VERSION "1.9.9"| #define PACKAGE_STRING "GNOME Web Browser 1.9.9"| #define PACKAGE_BUGREPORT "http://bugzilla.gnome.org/enter_bug.cgi?product=epiphany"| #define PACKAGE "epiphany"| #define VERSION "1.9.9"| #define STDC_HEADERS 1| #define HAVE_SYS_TYPES_H 1| #define HAVE_SYS_STAT_H 1| #define HAVE_STDLIB_H 1| #define HAVE_STRING_H 1| #define HAVE_MEMORY_H 1| #define HAVE_STRINGS_H 1| #define HAVE_INTTYPES_H 1| #define HAVE_STDINT_H 1| #define HAVE_UNISTD_H 1| #define HAVE_DLFCN_H 1| #ifdef __cplusplus| extern "C" void std::exit (int) throw (); using std::exit;| #endif| /* end confdefs.h.  */| /* Define dlopen to an innocuous variant, in case <limits.h> declares dlopen.|    For example, HP-UX 11i <limits.h> declares gettimeofday.  */| #define dlopen innocuous_dlopen| | /* System header to define __stub macros and hopefully few prototypes,|     which can conflict with char dlopen (); below.|     Prefer <limits.h> to <assert.h> if __STDC__ is defined, since|     <limits.h> exists even on freestanding compilers.  */| | #ifdef __STDC__| # include <limits.h>| #else| # include <assert.h>| #endif| | #undef dlopen| | /* Override any gcc2 internal prototype to avoid an error.  */| #ifdef __cplusplus| extern "C"| {| #endif| /* We use char because int might match the return type of a gcc2|    builtin and then its argument prototype would still apply.  */| char dlopen ();| /* The GNU C library defines this for functions which it implements|     to always fail with ENOSYS.  Some functions are actually named|     something starting with __ and the normal name is an alias.  */| #if defined (__stub_dlopen) || defined (__stub___dlopen)| choke me| #else| char (*f) () = dlopen;| #endif| #ifdef __cplusplus| }| #endif| | int| main ()| {| return f != dlopen;|   ;|   return 0;| }configure:8845: result: noconfigure:8850: checking for dlopen in -ldlconfigure:8880: gcc -o conftest -g   conftest.c -ldl   >&5configure:8886: $? = 0configure:8890: test -z 			 || test ! -s conftest.errconfigure:8893: $? = 0configure:8896: test -s conftestconfigure:8899: $? = 0configure:8912: result: yesconfigure:9087: checking whether a program can dlopen itselfconfigure:9159: gcc -o conftest -g  -DHAVE_DLFCN_H  -Wl,--export-dynamic conftest.c -ldl  >&5configure: In function 'main':configure:9155: warning: incompatible implicit declaration of built-in function 'exit'configure:9162: $? = 0configure:9180: result: yesconfigure:9185: checking whether a statically linked program can dlopen itselfconfigure:9257: gcc -o conftest -g  -DHAVE_DLFCN_H  -Wl,--export-dynamic  conftest.c -ldl  >&5configure: In function 'main':configure:9253: warning: incompatible implicit declaration of built-in function 'exit'configure:9260: $? = 0configure:9278: result: yesconfigure:9301: checking if libtool supports shared librariesconfigure:9303: result: yesconfigure:9306: checking whether to build shared librariesconfigure:9327: result: yesconfigure:9330: checking whether to build static librariesconfigure:9334: result: noconfigure:9426: creating libtoolconfigure:10004: checking for ld used by g++configure:10071: result: /usr/bin/ldconfigure:10080: checking if the linker (/usr/bin/ld) is GNU ldconfigure:10095: result: yesconfigure:10146: checking whether the g++ linker (/usr/bin/ld) supports shared librariesconfigure:11033: result: yesconfigure:11051: g++ -c -g -O2  conftest.cc >&5configure:11054: $? = 0configure:11150: checking for g++ option to produce PICconfigure:11418: result: -fPICconfigure:11426: checking if g++ PIC flag -fPIC worksconfigure:11444: g++ -c -g -O2  -fPIC -DPIC conftest.cc >&5configure:11448: $? = 0configure:11461: result: yesconfigure:11485: checking if g++ supports -c -o file.oconfigure:11506: g++ -c -g -O2  -o out/conftest2.o conftest.cc >&5configure:11510: $? = 0configure:11532: result: yesconfigure:11558: checking whether the g++ linker (/usr/bin/ld) supports shared librariesconfigure:11583: result: yesconfigure:11654: checking dynamic linker characteristicsconfigure:12221: result: GNU/Linux ld.soconfigure:12225: checking how to hardcode library paths into programsconfigure:12250: result: immediateconfigure:12264: checking whether stripping libraries is possibleconfigure:12269: result: yesconfigure:12395: checking for shl_loadconfigure:12483: result: noconfigure:12488: checking for shl_load in -ldldconfigure:12550: result: noconfigure:12555: checking for dlopenconfigure:12643: result: noconfigure:12648: checking for dlopen in -ldlconfigure:12710: result: yesconfigure:12885: checking whether a program can dlopen itselfconfigure:12978: result: yesconfigure:12983: checking whether a statically linked program can dlopen itselfconfigure:13076: result: yesconfigure:19818: checking for library containing strerrorconfigure:19848: gcc -o conftest -g   conftest.c  >&5configure:19854: $? = 0configure:19858: test -z 			 || test ! -s conftest.errconfigure:19861: $? = 0configure:19864: test -s conftestconfigure:19867: $? = 0configure:19937: result: none requiredconfigure:19990: checking for gccconfigure:20016: result: gccconfigure:20260: checking for C compiler versionconfigure:20263: gcc --version </dev/null >&5gcc (GCC) 4.0.3 20060212 (prerelease) (Ubuntu 4.0.2-9ubuntu1)Copyright (C) 2006 Free Software Foundation, Inc.This is free software; see the source for copying conditions.  There is NOwarranty; not even for MERCHANTABILITY or FITNESS FOR A PARTICULAR PURPOSE.configure:20266: $? = 0configure:20268: gcc -v </dev/null >&5Using built-in specs.Target: i486-linux-gnuConfigured with: ../src/configure -v --enable-languages=c,c++,java,f95,objc,ada,treelang --prefix=/usr --enable-shared --with-system-zlib --libexecdir=/usr/lib --without-included-gettext --enable-threads=posix --enable-nls --program-suffix=-4.0 --enable-__cxa_atexit --enable-clocale=gnu --enable-libstdcxx-debug --enable-java-awt=gtk-default --enable-gtk-cairo --with-java-home=/usr/lib/jvm/java-1.4.2-gcj-4.0-1.4.2.0/jre --enable-mpfr --disable-werror --with-tune=pentium4 --enable-checking=release i486-linux-gnuThread model: posixgcc version 4.0.3 20060212 (prerelease) (Ubuntu 4.0.2-9ubuntu1)configure:20271: $? = 0configure:20273: gcc -V </dev/null >&5gcc: '-V' option must have argumentconfigure:20276: $? = 1configure:20279: checking whether we are using the GNU C compilerconfigure:20335: result: yesconfigure:20341: checking whether gcc accepts -gconfigure:20392: result: yesconfigure:20409: checking for gcc option to accept ANSI Cconfigure:20516: result: none neededconfigure:20534: gcc -c -g  conftest.c >&5conftest.c:2: error: syntax error before 'me'configure:20540: $? = 1configure: failed program was:| #ifndef __cplusplus|   choke me| #endifconfigure:20675: checking dependency style of gccconfigure:20765: result: gcc3configure:20876: checking for C++ compiler versionconfigure:20879: g++ --version </dev/null >&5g++ (GCC) 4.0.3 20060212 (prerelease) (Ubuntu 4.0.2-9ubuntu1)Copyright (C) 2006 Free Software Foundation, Inc.This is free software; see the source for copying conditions.  There is NOwarranty; not even for MERCHANTABILITY or FITNESS FOR A PARTICULAR PURPOSE.configure:20882: $? = 0configure:20884: g++ -v </dev/null >&5Using built-in specs.Target: i486-linux-gnuConfigured with: ../src/configure -v --enable-languages=c,c++,java,f95,objc,ada,treelang --prefix=/usr --enable-shared --with-system-zlib --libexecdir=/usr/lib --without-included-gettext --enable-threads=posix --enable-nls --program-suffix=-4.0 --enable-__cxa_atexit --enable-clocale=gnu --enable-libstdcxx-debug --enable-java-awt=gtk-default --enable-gtk-cairo --with-java-home=/usr/lib/jvm/java-1.4.2-gcj-4.0-1.4.2.0/jre --enable-mpfr --disable-werror --with-tune=pentium4 --enable-checking=release i486-linux-gnuThread model: posixgcc version 4.0.3 20060212 (prerelease) (Ubuntu 4.0.2-9ubuntu1)configure:20887: $? = 0configure:20889: g++ -V </dev/null >&5g++: '-V' option must have argumentconfigure:20892: $? = 1configure:20895: checking whether we are using the GNU C++ compilerconfigure:20951: result: yesconfigure:20957: checking whether g++ accepts -gconfigure:21008: result: yesconfigure:21050: g++ -c -g -O2  conftest.cc >&5configure:21056: $? = 0configure:21060: test -z 			 || test ! -s conftest.errconfigure:21063: $? = 0configure:21066: test -s conftest.oconfigure:21069: $? = 0configure:21095: g++ -c -g -O2  conftest.cc >&5configure:21101: $? = 0configure:21105: test -z 			 || test ! -s conftest.errconfigure:21108: $? = 0configure:21111: test -s conftest.oconfigure:21114: $? = 0configure:21139: checking dependency style of g++configure:21229: result: gcc3configure:21292: checking for gccconfigure:21318: result: gccconfigure:21562: checking for C compiler versionconfigure:21565: gcc --version </dev/null >&5gcc (GCC) 4.0.3 20060212 (prerelease) (Ubuntu 4.0.2-9ubuntu1)Copyright (C) 2006 Free Software Foundation, Inc.This is free software; see the source for copying conditions.  There is NOwarranty; not even for MERCHANTABILITY or FITNESS FOR A PARTICULAR PURPOSE.configure:21568: $? = 0configure:21570: gcc -v </dev/null >&5Using built-in specs.Target: i486-linux-gnuConfigured with: ../src/configure -v --enable-languages=c,c++,java,f95,objc,ada,treelang --prefix=/usr --enable-shared --with-system-zlib --libexecdir=/usr/lib --without-included-gettext --enable-threads=posix --enable-nls --program-suffix=-4.0 --enable-__cxa_atexit --enable-clocale=gnu --enable-libstdcxx-debug --enable-java-awt=gtk-default --enable-gtk-cairo --with-java-home=/usr/lib/jvm/java-1.4.2-gcj-4.0-1.4.2.0/jre --enable-mpfr --disable-werror --with-tune=pentium4 --enable-checking=release i486-linux-gnuThread model: posixgcc version 4.0.3 20060212 (prerelease) (Ubuntu 4.0.2-9ubuntu1)configure:21573: $? = 0configure:21575: gcc -V </dev/null >&5gcc: '-V' option must have argumentconfigure:21578: $? = 1configure:21581: checking whether we are using the GNU C compilerconfigure:21637: result: yesconfigure:21643: checking whether gcc accepts -gconfigure:21694: result: yesconfigure:21711: checking for gcc option to accept ANSI Cconfigure:21818: result: none neededconfigure:21836: gcc -c -g  conftest.c >&5conftest.c:2: error: syntax error before 'me'configure:21842: $? = 1configure: failed program was:| #ifndef __cplusplus|   choke me| #endifconfigure:21977: checking dependency style of gccconfigure:22067: result: gcc3configure:22087: checking for ANSI C header filesconfigure:22243: result: yesconfigure:22255: checking for glib-genmarshalconfigure:22273: found /home/kikidonk/Devel/gnome-install/bin/glib-genmarshalconfigure:22285: result: /home/kikidonk/Devel/gnome-install/bin/glib-genmarshalconfigure:22294: checking for glib-mkenumsconfigure:22312: found /home/kikidonk/Devel/gnome-install/bin/glib-mkenumsconfigure:22324: result: /home/kikidonk/Devel/gnome-install/bin/glib-mkenumsconfigure:22344: checking for intltool >= 0.34.1configure:22351: result: 0.34.2 foundconfigure:22407: checking for perlconfigure:22425: found /usr/bin/perlconfigure:22437: result: /usr/bin/perlconfigure:22455: checking for XML::Parserconfigure:22458: result: okconfigure:22469: checking for iconvconfigure:22487: found /usr/bin/iconvconfigure:22500: result: /usr/bin/iconvconfigure:22509: checking for msgfmtconfigure:22527: found /home/kikidonk/Devel/gnome-install/bin/msgfmtconfigure:22540: result: /home/kikidonk/Devel/gnome-install/bin/msgfmtconfigure:22549: checking for msgmergeconfigure:22567: found /home/kikidonk/Devel/gnome-install/bin/msgmergeconfigure:22580: result: /home/kikidonk/Devel/gnome-install/bin/msgmergeconfigure:22589: checking for xgettextconfigure:22607: found /home/kikidonk/Devel/gnome-install/bin/xgettextconfigure:22620: result: /home/kikidonk/Devel/gnome-install/bin/xgettextconfigure:22684: checking for pkg-configconfigure:22702: found /home/kikidonk/Devel/gnome-install/bin/pkg-configconfigure:22714: result: /home/kikidonk/Devel/gnome-install/bin/pkg-configconfigure:22729: checking pkg-config is at least version 0.9.0configure:22732: result: yesconfigure:22793: checking whether gcc understands -Wno-sign-compareconfigure:22811: gcc -c -Wall -Wmissing-prototypes -Wnested-externs -Wpointer-arith -g -Wno-sign-compare  conftest.c >&5configure:22817: $? = 0configure:22821: test -z 			 || test ! -s conftest.errconfigure:22824: $? = 0configure:22827: test -s conftest.oconfigure:22830: $? = 0configure:22841: result: yesconfigure:22861: checking what warning flags to pass to the C compilerconfigure:22863: result: -Wall -Wmissing-prototypes -Wnested-externs -Wpointer-arith -Wno-sign-compare -Werrorconfigure:22874: checking what language compliance flags to pass to the C compilerconfigure:22889: result: configure:22904: checking what warning flags to pass to the C++ compilerconfigure:22924: result: -Wall -Wno-unusedconfigure:22935: checking what language compliance flags to pass to the C++ compilerconfigure:22951: result: configure:22988: checking for DEPENDENCIESconfigure:23008: $PKG_CONFIG --exists --print-errors "\		  glib-2.0 >= $GLIB_REQUIRED \		  gmodule-2.0 \		  gtk+-2.0 >= $GTK_REQUIRED \		  libxml-2.0 >= $LIBXML_REQUIRED \		  libxslt >= $LIBXSLT_REQUIRED \		  libgnomeui-2.0 >= $LIBGNOMEUI_REQUIRED \		  libglade-2.0 >= $LIBGLADE_REQUIRED \		  gnome-vfs-2.0 >= $LIBGNOMEVFS_REQUIRED \		  gnome-vfs-module-2.0 \		  gconf-2.0 \		  gnome-desktop-2.0 >= $GNOME_DESKTOP_REQUIRED \		  libstartup-notification-1.0 >= $LIBSTARTUP_NOTIFICATION_REQUIRED \		  libgnomeprint-2.2 >= $LIBGNOMEPRINT_REQUIRED \		  libgnomeprintui-2.2 >= $LIBGNOMEPRINTUI_REQUIRED \		  "configure:23026: $? = 0configure:23067: $PKG_CONFIG --exists --print-errors "\		  glib-2.0 >= $GLIB_REQUIRED \		  gmodule-2.0 \		  gtk+-2.0 >= $GTK_REQUIRED \		  libxml-2.0 >= $LIBXML_REQUIRED \		  libxslt >= $LIBXSLT_REQUIRED \		  libgnomeui-2.0 >= $LIBGNOMEUI_REQUIRED \		  libglade-2.0 >= $LIBGLADE_REQUIRED \		  gnome-vfs-2.0 >= $LIBGNOMEVFS_REQUIRED \		  gnome-vfs-module-2.0 \		  gconf-2.0 \		  gnome-desktop-2.0 >= $GNOME_DESKTOP_REQUIRED \		  libstartup-notification-1.0 >= $LIBSTARTUP_NOTIFICATION_REQUIRED \		  libgnomeprint-2.2 >= $LIBGNOMEPRINT_REQUIRED \		  libgnomeprintui-2.2 >= $LIBGNOMEPRINTUI_REQUIRED \		  "configure:23085: $? = 0configure:23200: result: yesconfigure:23213: checking for DBUSconfigure:23218: $PKG_CONFIG --exists --print-errors "dbus-glib-1 >= $DBUS_GLIB_REQUIRED"configure:23221: $? = 0configure:23232: $PKG_CONFIG --exists --print-errors "dbus-glib-1 >= $DBUS_GLIB_REQUIRED"configure:23235: $? = 0configure:23290: result: yesconfigure:23299: checking for dbus-binding-toolconfigure:23317: found /home/kikidonk/Devel/gnome-install/bin/dbus-binding-toolconfigure:23330: result: /home/kikidonk/Devel/gnome-install/bin/dbus-binding-toolconfigure:23363: result: Using config source xml:merged:/home/kikidonk/Devel/gnome-install/etc/gconf/gconf.xml.defaults for schema installationconfigure:23378: result: Using $(sysconfdir)/gconf/schemas as install directory for schema filesconfigure:23405: checking for gconftool-2configure:23423: found /home/kikidonk/Devel/gnome-install/bin/gconftool-2configure:23436: result: /home/kikidonk/Devel/gnome-install/bin/gconftool-2configure:23458: checking for mkdtempconfigure:23515: gcc -o conftest -g   conftest.c  >&5configure:23521: $? = 0configure:23525: test -z 			 || test ! -s conftest.errconfigure:23528: $? = 0configure:23531: test -s conftestconfigure:23534: $? = 0configure:23546: result: yesconfigure:23572: checking execinfo.h usabilityconfigure:23584: gcc -c -g  conftest.c >&5configure:23590: $? = 0configure:23594: test -z 			 || test ! -s conftest.errconfigure:23597: $? = 0configure:23600: test -s conftest.oconfigure:23603: $? = 0configure:23613: result: yesconfigure:23617: checking execinfo.h presenceconfigure:23627: gcc -E  conftest.cconfigure:23633: $? = 0configure:23653: result: yesconfigure:23688: checking for execinfo.hconfigure:23695: result: yesconfigure:23723: checking for compiler  optionconfigure:23737: gcc -c -g -Wdeclaration-after-statement  conftest.c >&5configure:23743: $? = 0configure:23747: test -z 			 || test ! -s conftest.errconfigure:23750: $? = 0configure:23753: test -s conftest.oconfigure:23756: $? = 0configure:23767: result: yesconfigure:23788: checking which gecko to useconfigure:23819: result: firefoxconfigure:23904: checking for compiler -fshort-wchar optionconfigure:23924: g++ -o conftest -g -O2  -fshort-wchar   conftest.cc  >&5configure:23927: $? = 0configure:23929: ./conftestconfigure:23932: $? = 0configure:23946: result: yesconfigure:23971: checking whether to enable C++ RTTIconfigure:23980: result: noconfigure:24006: checking whether we have a gtk 2 gecko buildconfigure:24025: g++ -o conftest -g -O2   -I/usr/include/mozilla-firefox  conftest.cc  >&5configure:24028: $? = 0configure:24030: ./conftestconfigure:24033: $? = 0configure:24048: result: yesconfigure:24051: checking whether we have a gecko debug buildconfigure:24066: g++ -c -g -O2   -I/usr/include/mozilla-firefox conftest.cc >&5conftest.cc:33:6: error: #error Noconfigure:24072: $? = 1configure: failed program was:| /* confdefs.h.  */| | #define PACKAGE_NAME "GNOME Web Browser"| #define PACKAGE_TARNAME "epiphany"| #define PACKAGE_VERSION "1.9.9"| #define PACKAGE_STRING "GNOME Web Browser 1.9.9"| #define PACKAGE_BUGREPORT "http://bugzilla.gnome.org/enter_bug.cgi?product=epiphany"| #define PACKAGE "epiphany"| #define VERSION "1.9.9"| #define STDC_HEADERS 1| #define HAVE_SYS_TYPES_H 1| #define HAVE_SYS_STAT_H 1| #define HAVE_STDLIB_H 1| #define HAVE_STRING_H 1| #define HAVE_MEMORY_H 1| #define HAVE_STRINGS_H 1| #define HAVE_INTTYPES_H 1| #define HAVE_STDINT_H 1| #define HAVE_UNISTD_H 1| #define HAVE_DLFCN_H 1| #ifdef __cplusplus| extern "C" void std::exit (int) throw (); using std::exit;| #endif| #define STDC_HEADERS 1| #define GNOME_ENABLE_DEBUG 1| #define MAINTAINER_MODE 1| #define HAVE_MKDTEMP 1| #define HAVE_EXECINFO_H 1| #define HAVE_MOZILLA_TOOLKIT 1| /* end confdefs.h.  */| #include <mozilla-config.h>| 		  #if !defined(MOZ_REFLOW_PERF) || !defined(MOZ_REFLOW_PERF_DSP)| 		  #error No| 		  #endif| configure:24095: result: noconfigure:24137: checking for gecko versionconfigure:24200: result: 1.8configure:24308: checking for GECKOconfigure:24313: $PKG_CONFIG --exists --print-errors "${gecko_cv_gecko}-xpcom >= $min_version $gecko_cv_extra_pkg_dependencies"configure:24316: $? = 0configure:24327: $PKG_CONFIG --exists --print-errors "${gecko_cv_gecko}-xpcom >= $min_version $gecko_cv_extra_pkg_dependencies"configure:24330: $? = 0configure:24385: result: yesconfigure:24398: checking whether nsIFilePicker methods expect nsAString&configure:24456: g++ -c -g -O2 -fno-rtti -fshort-wchar     -I/usr/include/mozilla-firefox -I/usr/include/mozilla-firefox -I/usr/include/mozilla-firefox/xpcom -I/usr/include/mozilla-firefox/string -I/usr/include/mozilla-firefox/nspr   -I/usr/include/mozilla-firefox/widget -I/usr/include/mozilla-firefox/dom -I/usr/include/mozilla-firefox/necko -I/usr/include/mozilla-firefox/pref conftest.cc >&5configure:24462: $? = 0configure:24466: test -z 			 || test ! -s conftest.errconfigure:24469: $? = 0configure:24472: test -s conftest.oconfigure:24475: $? = 0configure:24503: result: yesconfigure:24509: checking for nsIContentPolicy APIconfigure:24569: g++ -c -g -O2 -fno-rtti -fshort-wchar     -I/usr/include/mozilla-firefox -I/usr/include/mozilla-firefox -I/usr/include/mozilla-firefox/xpcom -I/usr/include/mozilla-firefox/string -I/usr/include/mozilla-firefox/nspr   -I/usr/include/mozilla-firefox/content -I/usr/include/mozilla-firefox/dom -I/usr/include/mozilla-firefox/necko -I/usr/include/mozilla-firefox/pref conftest.cc >&5configure:24575: $? = 0configure:24579: test -z 			 || test ! -s conftest.errconfigure:24582: $? = 0configure:24585: test -s conftest.oconfigure:24588: $? = 0configure:24612: result: variant 2configure:24623: checking for nsIXULChromeRegistry APIconfigure:24681: g++ -c -g -O2 -fno-rtti -fshort-wchar     -I/usr/include/mozilla-firefox -I/usr/include/mozilla-firefox -I/usr/include/mozilla-firefox/xpcom -I/usr/include/mozilla-firefox/string -I/usr/include/mozilla-firefox/nspr   -I/usr/include/mozilla-firefox/content -I/usr/include/mozilla-firefox/dom -I/usr/include/mozilla-firefox/necko -I/usr/include/mozilla-firefox/pref conftest.cc >&5conftest.cc: In function 'int main()':conftest.cc:41: error: 'class nsIXULChromeRegistry' has no member named 'SelectSkin'configure:24687: $? = 1configure: failed program was:| /* confdefs.h.  */| | #define PACKAGE_NAME "GNOME Web Browser"| #define PACKAGE_TARNAME "epiphany"| #define PACKAGE_VERSION "1.9.9"| #define PACKAGE_STRING "GNOME Web Browser 1.9.9"| #define PACKAGE_BUGREPORT "http://bugzilla.gnome.org/enter_bug.cgi?product=epiphany"| #define PACKAGE "epiphany"| #define VERSION "1.9.9"| #define STDC_HEADERS 1| #define HAVE_SYS_TYPES_H 1| #define HAVE_SYS_STAT_H 1| #define HAVE_STDLIB_H 1| #define HAVE_STRING_H 1| #define HAVE_MEMORY_H 1| #define HAVE_STRINGS_H 1| #define HAVE_INTTYPES_H 1| #define HAVE_STDINT_H 1| #define HAVE_UNISTD_H 1| #define HAVE_DLFCN_H 1| #ifdef __cplusplus| extern "C" void std::exit (int) throw (); using std::exit;| #endif| #define STDC_HEADERS 1| #define GNOME_ENABLE_DEBUG 1| #define MAINTAINER_MODE 1| #define HAVE_MKDTEMP 1| #define HAVE_EXECINFO_H 1| #define HAVE_MOZILLA_TOOLKIT 1| #define HAVE_GECKO_1_7 1| #define HAVE_GECKO_1_8 1| #define MOZ_NSIFILEPICKER_NSASTRING_ 1| #define MOZ_NSICONTENTPOLICY_VARIANT 2| /* end confdefs.h.  */| #include <nsEmbedString.h>| 		  #include <nsIChromeRegistry.h>| int| main ()| {| nsIXULChromeRegistry *p;| 		  p->SelectSkin (nsEmbedCString(), PR_FALSE);| |   ;|   return 0;| }configure:24728: result: noconfigure:24783: checking chrome/nsIChromeRegistrySea.h usabilityconfigure:24795: g++ -c -g -O2 -fno-rtti -fshort-wchar     -I/usr/include/mozilla-firefox -I/usr/include/mozilla-firefox -I/usr/include/mozilla-firefox/xpcom -I/usr/include/mozilla-firefox/string -I/usr/include/mozilla-firefox/nspr   -I/usr/include/mozilla-firefox/dom -I/usr/include/mozilla-firefox/necko -I/usr/include/mozilla-firefox/pref conftest.cc >&5conftest.cc:69:41: error: chrome/nsIChromeRegistrySea.h: No such file or directoryconfigure:24801: $? = 1configure: failed program was:| /* confdefs.h.  */| | #define PACKAGE_NAME "GNOME Web Browser"| #define PACKAGE_TARNAME "epiphany"| #define PACKAGE_VERSION "1.9.9"| #define PACKAGE_STRING "GNOME Web Browser 1.9.9"| #define PACKAGE_BUGREPORT "http://bugzilla.gnome.org/enter_bug.cgi?product=epiphany"| #define PACKAGE "epiphany"| #define VERSION "1.9.9"| #define STDC_HEADERS 1| #define HAVE_SYS_TYPES_H 1| #define HAVE_SYS_STAT_H 1| #define HAVE_STDLIB_H 1| #define HAVE_STRING_H 1| #define HAVE_MEMORY_H 1| #define HAVE_STRINGS_H 1| #define HAVE_INTTYPES_H 1| #define HAVE_STDINT_H 1| #define HAVE_UNISTD_H 1| #define HAVE_DLFCN_H 1| #ifdef __cplusplus| extern "C" void std::exit (int) throw (); using std::exit;| #endif| #define STDC_HEADERS 1| #define GNOME_ENABLE_DEBUG 1| #define MAINTAINER_MODE 1| #define HAVE_MKDTEMP 1| #define HAVE_EXECINFO_H 1| #define HAVE_MOZILLA_TOOLKIT 1| #define HAVE_GECKO_1_7 1| #define HAVE_GECKO_1_8 1| #define MOZ_NSIFILEPICKER_NSASTRING_ 1| #define MOZ_NSICONTENTPOLICY_VARIANT 2| /* end confdefs.h.  */| #include <stdio.h>| #if HAVE_SYS_TYPES_H| # include <sys/types.h>| #endif| #if HAVE_SYS_STAT_H| # include <sys/stat.h>| #endif| #if STDC_HEADERS| # include <stdlib.h>| # include <stddef.h>| #else| # if HAVE_STDLIB_H| #  include <stdlib.h>| # endif| #endif| #if HAVE_STRING_H| # if !STDC_HEADERS && HAVE_MEMORY_H| #  include <memory.h>| # endif| # include <string.h>| #endif| #if HAVE_STRINGS_H| # include <strings.h>| #endif| #if HAVE_INTTYPES_H| # include <inttypes.h>| #else| # if HAVE_STDINT_H| #  include <stdint.h>| # endif| #endif| #if HAVE_UNISTD_H| # include <unistd.h>| #endif| #include <chrome/nsIChromeRegistrySea.h>configure:24824: result: noconfigure:24828: checking chrome/nsIChromeRegistrySea.h presenceconfigure:24838: g++ -E   -I/usr/include/mozilla-firefox -I/usr/include/mozilla-firefox -I/usr/include/mozilla-firefox/xpcom -I/usr/include/mozilla-firefox/string -I/usr/include/mozilla-firefox/nspr   -I/usr/include/mozilla-firefox/dom -I/usr/include/mozilla-firefox/necko -I/usr/include/mozilla-firefox/pref conftest.ccconftest.cc:35:41: error: chrome/nsIChromeRegistrySea.h: No such file or directoryconfigure:24844: $? = 1configure: failed program was:| /* confdefs.h.  */| | #define PACKAGE_NAME "GNOME Web Browser"| #define PACKAGE_TARNAME "epiphany"| #define PACKAGE_VERSION "1.9.9"| #define PACKAGE_STRING "GNOME Web Browser 1.9.9"| #define PACKAGE_BUGREPORT "http://bugzilla.gnome.org/enter_bug.cgi?product=epiphany"| #define PACKAGE "epiphany"| #define VERSION "1.9.9"| #define STDC_HEADERS 1| #define HAVE_SYS_TYPES_H 1| #define HAVE_SYS_STAT_H 1| #define HAVE_STDLIB_H 1| #define HAVE_STRING_H 1| #define HAVE_MEMORY_H 1| #define HAVE_STRINGS_H 1| #define HAVE_INTTYPES_H 1| #define HAVE_STDINT_H 1| #define HAVE_UNISTD_H 1| #define HAVE_DLFCN_H 1| #ifdef __cplusplus| extern "C" void std::exit (int) throw (); using std::exit;| #endif| #define STDC_HEADERS 1| #define GNOME_ENABLE_DEBUG 1| #define MAINTAINER_MODE 1| #define HAVE_MKDTEMP 1| #define HAVE_EXECINFO_H 1| #define HAVE_MOZILLA_TOOLKIT 1| #define HAVE_GECKO_1_7 1| #define HAVE_GECKO_1_8 1| #define MOZ_NSIFILEPICKER_NSASTRING_ 1| #define MOZ_NSICONTENTPOLICY_VARIANT 2| /* end confdefs.h.  */| #include <chrome/nsIChromeRegistrySea.h>configure:24864: result: noconfigure:24899: checking for chrome/nsIChromeRegistrySea.hconfigure:24906: result: noconfigure:24935: checking for mozilla security compomentconfigure:24992: g++ -c -g -O2 -fno-rtti -fshort-wchar     -I/usr/include/mozilla-firefox -I/usr/include/mozilla-firefox -I/usr/include/mozilla-firefox/xpcom -I/usr/include/mozilla-firefox/string -I/usr/include/mozilla-firefox/nspr   -I/usr/include/mozilla-firefox/pipnss -I/usr/include/mozilla-firefox/dom -I/usr/include/mozilla-firefox/necko -I/usr/include/mozilla-firefox/pref conftest.cc >&5configure:24998: $? = 0configure:25002: test -z 			 || test ! -s conftest.errconfigure:25005: $? = 0configure:25008: test -s conftest.oconfigure:25011: $? = 0configure:25035: result: yesconfigure:25050: checking whether typeaheadfind is brokenconfigure:25167: g++ -o conftest -g -O2 -fno-rtti -fshort-wchar     -I/usr/include/mozilla-firefox -I/usr/include/mozilla-firefox -I/usr/include/mozilla-firefox/xpcom -I/usr/include/mozilla-firefox/string -I/usr/include/mozilla-firefox/nspr   -I/usr/include/mozilla-firefox/dom -I/usr/include/mozilla-firefox/necko -I/usr/include/mozilla-firefox/pref   -L/usr/lib/mozilla-firefox -lxpcom -lplds4 -lplc4 -lnspr4 -lpthread -ldl   -Wl,--rpath=/usr/lib/mozilla-firefox conftest.cc  >&5/usr/bin/ld: cannot find -lxpcomcollect2: ld returned 1 exit statusconfigure:25170: $? = 1configure: program exited with status 1configure: failed program was:| /* confdefs.h.  */| | #define PACKAGE_NAME "GNOME Web Browser"| #define PACKAGE_TARNAME "epiphany"| #define PACKAGE_VERSION "1.9.9"| #define PACKAGE_STRING "GNOME Web Browser 1.9.9"| #define PACKAGE_BUGREPORT "http://bugzilla.gnome.org/enter_bug.cgi?product=epiphany"| #define PACKAGE "epiphany"| #define VERSION "1.9.9"| #define STDC_HEADERS 1| #define HAVE_SYS_TYPES_H 1| #define HAVE_SYS_STAT_H 1| #define HAVE_STDLIB_H 1| #define HAVE_STRING_H 1| #define HAVE_MEMORY_H 1| #define HAVE_STRINGS_H 1| #define HAVE_INTTYPES_H 1| #define HAVE_STDINT_H 1| #define HAVE_UNISTD_H 1| #define HAVE_DLFCN_H 1| #ifdef __cplusplus| extern "C" void std::exit (int) throw (); using std::exit;| #endif| #define STDC_HEADERS 1| #define GNOME_ENABLE_DEBUG 1| #define MAINTAINER_MODE 1| #define HAVE_MKDTEMP 1| #define HAVE_EXECINFO_H 1| #define HAVE_MOZILLA_TOOLKIT 1| #define HAVE_GECKO_1_7 1| #define HAVE_GECKO_1_8 1| #define MOZ_NSIFILEPICKER_NSASTRING_ 1| #define MOZ_NSICONTENTPOLICY_VARIANT 2| #define HAVE_TYPEAHEADFIND 1| /* end confdefs.h.  */| | #include <mozilla-config.h>| #include <stdlib.h>| #include <stdio.h>| #include <nsXPCOM.h>| #include <nsCOMPtr.h>| #include <nsILocalFile.h>| #include <nsIServiceManager.h>| #ifdef HAVE_GECKO_1_8| #include <nsStringAPI.h>| #else| #include <nsString.h>| #endif| | #include <nsIComponentRegistrar.h>| int| main ()| {| | // redirect unwanted mozilla debug output to the bit bucket| freopen ("/dev/null", "w", stdout);| freopen ("/dev/null", "w", stderr);| | nsresult rv;| nsCOMPtr<nsILocalFile> directory;| rv = NS_NewNativeLocalFile (NS_LITERAL_CSTRING("/usr/lib/mozilla-firefox"), PR_FALSE,| 			    getter_AddRefs (directory));| if (NS_FAILED (rv) || !directory) {| 	exit (EXIT_FAILURE);| }| | rv = NS_InitXPCOM2 (nsnull, directory, nsnull);| if (NS_FAILED (rv)) {| 	exit (EXIT_FAILURE);| }| | PRBool retval = PR_FALSE;| | // now put in the BODY, scoped with do...while(0) to ensure we don't hold a| // COMptr after XPCOM shutdown and so we can jump out with a simple |break|.| do {| | | nsCOMPtr<nsIComponentRegistrar> registrar;| rv = NS_GetComponentRegistrar (getter_AddRefs (registrar));| if (NS_FAILED (rv)) break;| | nsCID *classID = nsnull;| rv = registrar->ContractIDToCID ("@mozilla.org/typeaheadfind;1", &classID);| if (NS_FAILED (rv) || !classID) break;| | nsCID badClassID = { 0x46590685, 0xbc00, 0x4aac,| 		     { 0xab, 0xed, 0x2c, 0x10, 0xa5, 0xb9, 0x45, 0xa4 } };| | retval = ! classID->Equals (badClassID);| | | | } while (0);| | NS_ShutdownXPCOM (nsnull);| exit (retval ? EXIT_SUCCESS : EXIT_FAILURE);| |   ;|   return 0;| }| configure:25202: result: yesconfigure:25206: error: You must not compile firefox with the "typeaheadfind" extension enabled!## ---------------- #### Cache variables. #### ---------------- ##ac_cv_build=i686-pc-linux-gnuac_cv_build_alias=i686-pc-linux-gnuac_cv_c_compiler_gnu=yesac_cv_cxx_compiler_gnu=yesac_cv_env_CC_set=ac_cv_env_CC_value=ac_cv_env_CFLAGS_set=setac_cv_env_CFLAGS_value=-gac_cv_env_CPPFLAGS_set=ac_cv_env_CPPFLAGS_value=ac_cv_env_CPP_set=ac_cv_env_CPP_value=ac_cv_env_CXXCPP_set=ac_cv_env_CXXCPP_value=ac_cv_env_CXXFLAGS_set=ac_cv_env_CXXFLAGS_value=ac_cv_env_CXX_set=ac_cv_env_CXX_value=ac_cv_env_DBUS_CFLAGS_set=ac_cv_env_DBUS_CFLAGS_value=ac_cv_env_DBUS_LIBS_set=ac_cv_env_DBUS_LIBS_value=ac_cv_env_DEPENDENCIES_CFLAGS_set=ac_cv_env_DEPENDENCIES_CFLAGS_value=ac_cv_env_DEPENDENCIES_LIBS_set=ac_cv_env_DEPENDENCIES_LIBS_value=ac_cv_env_DESKTOP_FILE_PLUGIN_DEP_CFLAGS_set=ac_cv_env_DESKTOP_FILE_PLUGIN_DEP_CFLAGS_value=ac_cv_env_DESKTOP_FILE_PLUGIN_DEP_LIBS_set=ac_cv_env_DESKTOP_FILE_PLUGIN_DEP_LIBS_value=ac_cv_env_F77_set=ac_cv_env_F77_value=ac_cv_env_FFLAGS_set=ac_cv_env_FFLAGS_value=ac_cv_env_GDU_MODULE_VERSION_CHECK_CFLAGS_set=ac_cv_env_GDU_MODULE_VERSION_CHECK_CFLAGS_value=ac_cv_env_GDU_MODULE_VERSION_CHECK_LIBS_set=ac_cv_env_GDU_MODULE_VERSION_CHECK_LIBS_value=ac_cv_env_GECKO_CFLAGS_set=ac_cv_env_GECKO_CFLAGS_value=ac_cv_env_GECKO_LIBS_set=ac_cv_env_GECKO_LIBS_value=ac_cv_env_LDFLAGS_set=ac_cv_env_LDFLAGS_value=ac_cv_env_PKG_CONFIG_set=ac_cv_env_PKG_CONFIG_value=ac_cv_env_PYGTK_CFLAGS_set=ac_cv_env_PYGTK_CFLAGS_value=ac_cv_env_PYGTK_LIBS_set=ac_cv_env_PYGTK_LIBS_value=ac_cv_env_build_alias_set=ac_cv_env_build_alias_value=ac_cv_env_host_alias_set=ac_cv_env_host_alias_value=ac_cv_env_target_alias_set=ac_cv_env_target_alias_value=ac_cv_exeext=ac_cv_f77_compiler_gnu=noac_cv_func_dlopen=noac_cv_func_mkdtemp=yesac_cv_func_shl_load=noac_cv_have_declaration_after_statement=yesac_cv_header_chrome_nsIChromeRegistrySea_h=noac_cv_header_dlfcn_h=yesac_cv_header_execinfo_h=yesac_cv_header_inttypes_h=yesac_cv_header_memory_h=yesac_cv_header_stdc=yesac_cv_header_stdint_h=yesac_cv_header_stdlib_h=yesac_cv_header_string_h=yesac_cv_header_strings_h=yesac_cv_header_sys_stat_h=yesac_cv_header_sys_types_h=yesac_cv_header_unistd_h=yesac_cv_host=i686-pc-linux-gnuac_cv_host_alias=i686-pc-linux-gnuac_cv_lib_dl_dlopen=yesac_cv_lib_dld_shl_load=noac_cv_objext=oac_cv_path_DBUS_BINDING_TOOL=/home/kikidonk/Devel/gnome-install/bin/dbus-binding-toolac_cv_path_GCONFTOOL=/home/kikidonk/Devel/gnome-install/bin/gconftool-2ac_cv_path_GLIB_GENMARSHAL=/home/kikidonk/Devel/gnome-install/bin/glib-genmarshalac_cv_path_GLIB_MKENUMS=/home/kikidonk/Devel/gnome-install/bin/glib-mkenumsac_cv_path_INTLTOOL_ICONV=/usr/bin/iconvac_cv_path_INTLTOOL_MSGFMT=/home/kikidonk/Devel/gnome-install/bin/msgfmtac_cv_path_INTLTOOL_MSGMERGE=/home/kikidonk/Devel/gnome-install/bin/msgmergeac_cv_path_INTLTOOL_PERL=/usr/bin/perlac_cv_path_INTLTOOL_XGETTEXT=/home/kikidonk/Devel/gnome-install/bin/xgettextac_cv_path_ac_pt_PKG_CONFIG=/home/kikidonk/Devel/gnome-install/bin/pkg-configac_cv_prog_AWK=gawkac_cv_prog_CPP='gcc -E'ac_cv_prog_CXXCPP='g++ -E'ac_cv_prog_ac_ct_AR=arac_cv_prog_ac_ct_CC=gccac_cv_prog_ac_ct_CXX=g++ac_cv_prog_ac_ct_RANLIB=ranlibac_cv_prog_ac_ct_STRIP=stripac_cv_prog_cc_g=yesac_cv_prog_cc_stdc=ac_cv_prog_cxx_g=yesac_cv_prog_egrep='grep -E'ac_cv_prog_f77_g=noac_cv_prog_make_make_set=yesac_cv_search_strerror='none required'am_cv_CC_dependencies_compiler_type=gcc3am_cv_CXX_dependencies_compiler_type=gcc3am_cv_prog_cc_stdc=gecko_cv_extra_libs=gecko_cv_extra_pkg_dependencies=firefox-gtkmozembedgecko_cv_gecko=firefoxgecko_cv_gecko_flavour=toolkitgecko_cv_gecko_version=1.8gecko_cv_gecko_version_major=1gecko_cv_gecko_version_minor=8gecko_cv_have_debug=nogecko_cv_have_gecko=yesgecko_cv_have_gecko_1_7=yesgecko_cv_have_gecko_1_8=yesgecko_cv_have_usable_wchar_option=yeslt_cv_deplibs_check_method=pass_alllt_cv_dlopen=dlopenlt_cv_dlopen_libs=-ldllt_cv_dlopen_self=yeslt_cv_dlopen_self_static=yeslt_cv_file_magic_cmd='$MAGIC_CMD'lt_cv_file_magic_test_file=lt_cv_ld_reload_flag=-rlt_cv_objdir=.libslt_cv_path_LD=/usr/bin/ldlt_cv_path_LDCXX=/usr/bin/ldlt_cv_path_NM='/usr/bin/nm -B'lt_cv_path_SED=/bin/sedlt_cv_prog_compiler_c_o=yeslt_cv_prog_compiler_c_o_CXX=yeslt_cv_prog_compiler_rtti_exceptions=nolt_cv_prog_gnu_ld=yeslt_cv_prog_gnu_ldcxx=yeslt_cv_sys_global_symbol_pipe='sed -n -e '\''s/^.*[ 	]\([ABCDGIRSTW][ABCDGIRSTW]*\)[ 	][ 	]*\([_A-Za-z][_A-Za-z0-9]*\)$/\1 \2 \2/p'\'''lt_cv_sys_global_symbol_to_c_name_address='sed -n -e '\''s/^: \([^ ]*\) $/  {\"\1\", (lt_ptr) 0},/p'\'' -e '\''s/^[BCDEGRST] \([^ ]*\) \([^ ]*\)$/  {"\2", (lt_ptr) \&\2},/p'\'''lt_cv_sys_global_symbol_to_cdecl='sed -n -e '\''s/^. .* \(.*\)$/extern int \1;/p'\'''lt_cv_sys_max_cmd_len=32768lt_lt_cv_prog_compiler_c_o='"yes"'lt_lt_cv_prog_compiler_c_o_CXX='"yes"'lt_lt_cv_sys_global_symbol_pipe='"sed -n -e '\''s/^.*[ 	]\\([ABCDGIRSTW][ABCDGIRSTW]*\\)[ 	][ 	]*\\([_A-Za-z][_A-Za-z0-9]*\\)\$/\\1 \\2 \\2/p'\''"'lt_lt_cv_sys_global_symbol_to_c_name_address='"sed -n -e '\''s/^: \\([^ ]*\\) \$/  {\\\"\\1\\\", (lt_ptr) 0},/p'\'' -e '\''s/^[BCDEGRST] \\([^ ]*\\) \\([^ ]*\\)\$/  {\"\\2\", (lt_ptr) \\&\\2},/p'\''"'lt_lt_cv_sys_global_symbol_to_cdecl='"sed -n -e '\''s/^. .* \\(.*\\)\$/extern int \\1;/p'\''"'pkg_cv_DBUS_CFLAGS='-I/home/kikidonk/Devel/gnome-install/include/dbus-1.0 -I/home/kikidonk/Devel/gnome-install/lib/dbus-1.0/include -I/home/kikidonk/Devel/gnome-install/include/glib-2.0 -I/home/kikidonk/Devel/gnome-install/lib/glib-2.0/include  'pkg_cv_DBUS_LIBS='-L/home/kikidonk/Devel/gnome-install/lib -ldbus-glib-1 -ldbus-1 -lglib-2.0  'pkg_cv_DEPENDENCIES_CFLAGS='-DORBIT2=1 -pthread -I/home/kikidonk/Devel/gnome-install/include/glib-2.0 -I/home/kikidonk/Devel/gnome-install/lib/glib-2.0/include -I/home/kikidonk/Devel/gnome-install/include/gtk-2.0 -I/home/kikidonk/Devel/gnome-install/lib/gtk-2.0/include -I/home/kikidonk/Devel/gnome-install/include/atk-1.0 -I/usr/include/freetype2 -I/home/kikidonk/Devel/gnome-install/include/cairo -I/home/kikidonk/Devel/gnome-install/include/pango-1.0 -I/home/kikidonk/Devel/gnome-install/include/libxml2 -I/home/kikidonk/Devel/gnome-install/include -I/home/kikidonk/Devel/gnome-install/include/libgnomeui-2.0 -I/home/kikidonk/Devel/gnome-install/include/libgnome-2.0 -I/home/kikidonk/Devel/gnome-install/include/libgnomecanvas-2.0 -I/home/kikidonk/Devel/gnome-install/include/libart-2.0 -I/home/kikidonk/Devel/gnome-install/include/gconf/2 -I/home/kikidonk/Devel/gnome-install/include/libbonoboui-2.0 -I/home/kikidonk/Devel/gnome-install/include/gnome-vfs-2.0 -I/home/kikidonk/Devel/gnome-install/lib/gnome-vfs-2.0/include -I/home/kikidonk/Devel/gnome-install/include/gnome-keyring-1 -I/home/kikidonk/Devel/gnome-install/include/orbit-2.0 -I/home/kikidonk/Devel/gnome-install/include/libbonobo-2.0 -I/home/kikidonk/Devel/gnome-install/include/bonobo-activation-2.0 -I/home/kikidonk/Devel/gnome-install/include/libglade-2.0 -I/home/kikidonk/Devel/gnome-install/include/gnome-vfs-module-2.0 -I/home/kikidonk/Devel/gnome-install/include/gnome-desktop-2.0 -I/home/kikidonk/Devel/gnome-install/include/startup-notification-1.0 -I/home/kikidonk/Devel/gnome-install/include/libgnomeprint-2.2 -I/home/kikidonk/Devel/gnome-install/include/libgnomeprintui-2.2  'pkg_cv_DEPENDENCIES_LIBS='-Wl,--export-dynamic -pthread -L/home/kikidonk/Devel/gnome-install/lib -lxslt -lglade-2.0 -lgnome-desktop-2 -lgnomeui-2 -lSM -lICE -lbonoboui-2 -lgnome-keyring -lgnome-2 -lpopt -lgnomevfs-2 -lbonobo-2 -lgconf-2 -lbonobo-activation -lORBit-2 -lgthread-2.0 -lstartup-notification-1 -lgnomeprintui-2-2 -lgnomeprint-2-2 -lgnomecanvas-2 -lxml2 -lart_lgpl_2 -lpangoft2-1.0 -lgtk-x11-2.0 -lgdk-x11-2.0 -latk-1.0 -lgdk_pixbuf-2.0 -lm -lpangocairo-1.0 -lpango-1.0 -lfreetype -lz -lcairo -lgobject-2.0 -lgmodule-2.0 -ldl -lglib-2.0  'pkg_cv_GECKO_CFLAGS='-I/usr/include/mozilla-firefox -I/usr/include/mozilla-firefox/xpcom -I/usr/include/mozilla-firefox/string -I/usr/include/mozilla-firefox/nspr -I/usr/include/mozilla-firefox/gtkembedmoz  'pkg_cv_GECKO_LIBS='-L/usr/lib/mozilla-firefox -lgtkembedmoz -lxpcom -lplds4 -lplc4 -lnspr4 -lpthread -ldl  '## ----------------- #### Output variables. #### ----------------- ##ACLOCAL='${SHELL} /home/kikidonk/Devel/gnome/epiphany/missing --run aclocal-1.9'ACLOCAL_AMFLAGS='${ACLOCAL_FLAGS}'AMDEPBACKSLASH='\'AMDEP_FALSE='#'AMDEP_TRUE=''AMTAR='${SHELL} /home/kikidonk/Devel/gnome/epiphany/missing --run tar'AM_CFLAGS=''AM_CPPFLAGS=''AM_CXXFLAGS='-fno-rtti  -fshort-wchar'AM_LDFLAGS=''AR='ar'AUTOCONF='${SHELL} /home/kikidonk/Devel/gnome/epiphany/missing --run autoconf'AUTOHEADER='${SHELL} /home/kikidonk/Devel/gnome/epiphany/missing --run autoheader'AUTOMAKE='${SHELL} /home/kikidonk/Devel/gnome/epiphany/missing --run automake-1.9'AWK='gawk'CATALOGS=''CATOBJEXT=''CC='gcc'CCDEPMODE='depmode=gcc3'CFLAGS='-g'CONFIG_STATUS_DEPENDENCIES=''CPP='gcc -E'CPPFLAGS=''CXX='g++'CXXCPP='g++ -E'CXXDEPMODE='depmode=gcc3'CXXFLAGS='-g -O2'CYGPATH_W='echo'DATADIRNAME=''DBUS_BINDING_TOOL='/home/kikidonk/Devel/gnome-install/bin/dbus-binding-tool'DBUS_CFLAGS='-I/home/kikidonk/Devel/gnome-install/include/dbus-1.0 -I/home/kikidonk/Devel/gnome-install/lib/dbus-1.0/include -I/home/kikidonk/Devel/gnome-install/include/glib-2.0 -I/home/kikidonk/Devel/gnome-install/lib/glib-2.0/include  'DBUS_LIBS='-L/home/kikidonk/Devel/gnome-install/lib -ldbus-glib-1 -ldbus-1 -lglib-2.0  'DEFS=''DEPDIR='.deps'DEPENDENCIES_CFLAGS='-DORBIT2=1 -pthread -I/home/kikidonk/Devel/gnome-install/include/glib-2.0 -I/home/kikidonk/Devel/gnome-install/lib/glib-2.0/include -I/home/kikidonk/Devel/gnome-install/include/gtk-2.0 -I/home/kikidonk/Devel/gnome-install/lib/gtk-2.0/include -I/home/kikidonk/Devel/gnome-install/include/atk-1.0 -I/usr/include/freetype2 -I/home/kikidonk/Devel/gnome-install/include/cairo -I/home/kikidonk/Devel/gnome-install/include/pango-1.0 -I/home/kikidonk/Devel/gnome-install/include/libxml2 -I/home/kikidonk/Devel/gnome-install/include -I/home/kikidonk/Devel/gnome-install/include/libgnomeui-2.0 -I/home/kikidonk/Devel/gnome-install/include/libgnome-2.0 -I/home/kikidonk/Devel/gnome-install/include/libgnomecanvas-2.0 -I/home/kikidonk/Devel/gnome-install/include/libart-2.0 -I/home/kikidonk/Devel/gnome-install/include/gconf/2 -I/home/kikidonk/Devel/gnome-install/include/libbonoboui-2.0 -I/home/kikidonk/Devel/gnome-install/include/gnome-vfs-2.0 -I/home/kikidonk/Devel/gnome-install/lib/gnome-vfs-2.0/include -I/home/kikidonk/Devel/gnome-install/include/gnome-keyring-1 -I/home/kikidonk/Devel/gnome-install/include/orbit-2.0 -I/home/kikidonk/Devel/gnome-install/include/libbonobo-2.0 -I/home/kikidonk/Devel/gnome-install/include/bonobo-activation-2.0 -I/home/kikidonk/Devel/gnome-install/include/libglade-2.0 -I/home/kikidonk/Devel/gnome-install/include/gnome-vfs-module-2.0 -I/home/kikidonk/Devel/gnome-install/include/gnome-desktop-2.0 -I/home/kikidonk/Devel/gnome-install/include/startup-notification-1.0 -I/home/kikidonk/Devel/gnome-install/include/libgnomeprint-2.2 -I/home/kikidonk/Devel/gnome-install/include/libgnomeprintui-2.2  'DEPENDENCIES_LIBS='-Wl,--export-dynamic -pthread -L/home/kikidonk/Devel/gnome-install/lib -lxslt -lglade-2.0 -lgnome-desktop-2 -lgnomeui-2 -lSM -lICE -lbonoboui-2 -lgnome-keyring -lgnome-2 -lpopt -lgnomevfs-2 -lbonobo-2 -lgconf-2 -lbonobo-activation -lORBit-2 -lgthread-2.0 -lstartup-notification-1 -lgnomeprintui-2-2 -lgnomeprint-2-2 -lgnomecanvas-2 -lxml2 -lart_lgpl_2 -lpangoft2-1.0 -lgtk-x11-2.0 -lgdk-x11-2.0 -latk-1.0 -lgdk_pixbuf-2.0 -lm -lpangocairo-1.0 -lpango-1.0 -lfreetype -lz -lcairo -lgobject-2.0 -lgmodule-2.0 -ldl -lglib-2.0  'DESKTOP_FILE_PLUGIN_DEP_CFLAGS=''DESKTOP_FILE_PLUGIN_DEP_LIBS=''DOC_USER_FORMATS=''ECHO='echo'ECHO_C=''ECHO_N='-n'ECHO_T=''EGREP='grep -E'ENABLE_CERTIFICATE_MANAGER_FALSE=''ENABLE_CERTIFICATE_MANAGER_TRUE=''ENABLE_DESKTOP_FILE_PLUGIN_FALSE=''ENABLE_DESKTOP_FILE_PLUGIN_TRUE=''ENABLE_FILEPICKER_FALSE=''ENABLE_FILEPICKER_TRUE=''ENABLE_GTK_DOC_FALSE=''ENABLE_GTK_DOC_TRUE=''ENABLE_NETWORK_MANAGER_FALSE=''ENABLE_NETWORK_MANAGER_TRUE=''ENABLE_PYTHON_FALSE=''ENABLE_PYTHON_TRUE=''ENABLE_SK_FALSE=''ENABLE_SK_TRUE=''ENABLE_ZEROCONF_FALSE=''ENABLE_ZEROCONF_TRUE=''EPIPHANY_API_VERSION='1.10'EPIPHANY_FEATURES=''EPIPHANY_MAJOR='1.9'EXEEXT=''F77=''FFLAGS=''GCONFTOOL='/home/kikidonk/Devel/gnome-install/bin/gconftool-2'GCONF_SCHEMAS_INSTALL_FALSE='#'GCONF_SCHEMAS_INSTALL_TRUE=''GCONF_SCHEMA_CONFIG_SOURCE='xml:merged:/home/kikidonk/Devel/gnome-install/etc/gconf/gconf.xml.defaults'GCONF_SCHEMA_FILE_DIR='$(sysconfdir)/gconf/schemas'GDU_MODULE_VERSION_CHECK_CFLAGS=''GDU_MODULE_VERSION_CHECK_LIBS=''GECKO_CFLAGS='-I/usr/include/mozilla-firefox -I/usr/include/mozilla-firefox/xpcom -I/usr/include/mozilla-firefox/string -I/usr/include/mozilla-firefox/nspr -I/usr/include/mozilla-firefox/gtkembedmoz  'GECKO_LIBS='-L/usr/lib/mozilla-firefox -lgtkembedmoz -lxpcom -lplds4 -lplc4 -lnspr4 -lpthread -ldl  'GETTEXT_PACKAGE=''GLIB_GENMARSHAL='/home/kikidonk/Devel/gnome-install/bin/glib-genmarshal'GLIB_MKENUMS='/home/kikidonk/Devel/gnome-install/bin/glib-mkenums'GMOFILES=''GMSGFMT=''GTK_DOC_USE_LIBTOOL_FALSE=''GTK_DOC_USE_LIBTOOL_TRUE=''HAVE_GECKO_1_7_FALSE='#'HAVE_GECKO_1_7_TRUE=''HAVE_GECKO_1_8_FALSE='#'HAVE_GECKO_1_8_TRUE=''HAVE_GECKO_1_9_FALSE=''HAVE_GECKO_1_9_TRUE='#'HAVE_GECKO_DEBUG_FALSE=''HAVE_GECKO_DEBUG_TRUE='#'HAVE_MOZILLA_PSM_FALSE=''HAVE_MOZILLA_PSM_TRUE=''HAVE_MOZILLA_TOOLKIT_FALSE='#'HAVE_MOZILLA_TOOLKIT_TRUE=''HELP_DIR=''HTML_DIR=''INSTALL_DATA='${INSTALL} -m 644'INSTALL_PROGRAM='${INSTALL}'INSTALL_SCRIPT='${INSTALL}'INSTALL_STRIP_PROGRAM='${SHELL} $(install_sh) -c -s'INSTOBJEXT=''INTLLIBS=''INTLTOOL_CAVES_RULE='%.caves:     %.caves.in     $(INTLTOOL_MERGE) $(wildcard $(top_srcdir)/po/*.po) ; LC_ALL=C $(INTLTOOL_MERGE) -d -u -c $(top_builddir)/po/.intltool-merge-cache $(top_srcdir)/po $< $@'INTLTOOL_DESKTOP_RULE='%.desktop:   %.desktop.in   $(INTLTOOL_MERGE) $(wildcard $(top_srcdir)/po/*.po) ; LC_ALL=C $(INTLTOOL_MERGE) -d -u -c $(top_builddir)/po/.intltool-merge-cache $(top_srcdir)/po $< $@'INTLTOOL_DIRECTORY_RULE='%.directory: %.directory.in $(INTLTOOL_MERGE) $(wildcard $(top_srcdir)/po/*.po) ; LC_ALL=C $(INTLTOOL_MERGE) -d -u -c $(top_builddir)/po/.intltool-merge-cache $(top_srcdir)/po $< $@'INTLTOOL_EXTRACT='$(top_builddir)/intltool-extract'INTLTOOL_ICONV='/usr/bin/iconv'INTLTOOL_KBD_RULE='%.kbd:       %.kbd.in       $(INTLTOOL_MERGE) $(wildcard $(top_srcdir)/po/*.po) ; LC_ALL=C $(INTLTOOL_MERGE) -x -u -m -c $(top_builddir)/po/.intltool-merge-cache $(top_srcdir)/po $< $@'INTLTOOL_KEYS_RULE='%.keys:      %.keys.in      $(INTLTOOL_MERGE) $(wildcard $(top_srcdir)/po/*.po) ; LC_ALL=C $(INTLTOOL_MERGE) -k -u -c $(top_builddir)/po/.intltool-merge-cache $(top_srcdir)/po $< $@'INTLTOOL_MERGE='$(top_builddir)/intltool-merge'INTLTOOL_MSGFMT='/home/kikidonk/Devel/gnome-install/bin/msgfmt'INTLTOOL_MSGMERGE='/home/kikidonk/Devel/gnome-install/bin/msgmerge'INTLTOOL_OAF_RULE='%.oaf:       %.oaf.in       $(INTLTOOL_MERGE) $(wildcard $(top_srcdir)/po/*.po) ; LC_ALL=C $(INTLTOOL_MERGE) -o -p $(top_srcdir)/po $< $@'INTLTOOL_PERL='/usr/bin/perl'INTLTOOL_PONG_RULE='%.pong:      %.pong.in      $(INTLTOOL_MERGE) $(wildcard $(top_srcdir)/po/*.po) ; LC_ALL=C $(INTLTOOL_MERGE) -x -u -c $(top_builddir)/po/.intltool-merge-cache $(top_srcdir)/po $< $@'INTLTOOL_PROP_RULE='%.prop:      %.prop.in      $(INTLTOOL_MERGE) $(wildcard $(top_srcdir)/po/*.po) ; LC_ALL=C $(INTLTOOL_MERGE) -d -u -c $(top_builddir)/po/.intltool-merge-cache $(top_srcdir)/po $< $@'INTLTOOL_SCHEMAS_RULE='%.schemas:   %.schemas.in   $(INTLTOOL_MERGE) $(wildcard $(top_srcdir)/po/*.po) ; LC_ALL=C $(INTLTOOL_MERGE) -s -u -c $(top_builddir)/po/.intltool-merge-cache $(top_srcdir)/po $< $@'INTLTOOL_SERVER_RULE='%.server:    %.server.in    $(INTLTOOL_MERGE) $(wildcard $(top_srcdir)/po/*.po) ; LC_ALL=C $(INTLTOOL_MERGE) -o -u -c $(top_builddir)/po/.intltool-merge-cache $(top_srcdir)/po $< $@'INTLTOOL_SERVICE_RULE='%.service: %.service.in   $(INTLTOOL_MERGE) $(wildcard $(top_srcdir)/po/*.po) ; LC_ALL=C $(INTLTOOL_MERGE) -d -u -c $(top_builddir)/po/.intltool-merge-cache $(top_srcdir)/po $< $@'INTLTOOL_SHEET_RULE='%.sheet:     %.sheet.in     $(INTLTOOL_MERGE) $(wildcard $(top_srcdir)/po/*.po) ; LC_ALL=C $(INTLTOOL_MERGE) -x -u -c $(top_builddir)/po/.intltool-merge-cache $(top_srcdir)/po $< $@'INTLTOOL_SOUNDLIST_RULE='%.soundlist: %.soundlist.in $(INTLTOOL_MERGE) $(wildcard $(top_srcdir)/po/*.po) ; LC_ALL=C $(INTLTOOL_MERGE) -d -u -c $(top_builddir)/po/.intltool-merge-cache $(top_srcdir)/po $< $@'INTLTOOL_THEME_RULE='%.theme:     %.theme.in     $(INTLTOOL_MERGE) $(wildcard $(top_srcdir)/po/*.po) ; LC_ALL=C $(INTLTOOL_MERGE) -d -u -c $(top_builddir)/po/.intltool-merge-cache $(top_srcdir)/po $< $@'INTLTOOL_UI_RULE='%.ui:        %.ui.in        $(INTLTOOL_MERGE) $(wildcard $(top_srcdir)/po/*.po) ; LC_ALL=C $(INTLTOOL_MERGE) -x -u -c $(top_builddir)/po/.intltool-merge-cache $(top_srcdir)/po $< $@'INTLTOOL_UPDATE='$(top_builddir)/intltool-update'INTLTOOL_XAM_RULE='%.xam:       %.xml.in       $(INTLTOOL_MERGE) $(wildcard $(top_srcdir)/po/*.po) ; LC_ALL=C $(INTLTOOL_MERGE) -x -u -c $(top_builddir)/po/.intltool-merge-cache $(top_srcdir)/po $< $@'INTLTOOL_XGETTEXT='/home/kikidonk/Devel/gnome-install/bin/xgettext'INTLTOOL_XML_NOMERGE_RULE='%.xml:       %.xml.in       $(INTLTOOL_MERGE) ; LC_ALL=C $(INTLTOOL_MERGE) -x -u /tmp $< $@'INTLTOOL_XML_RULE='%.xml:       %.xml.in       $(INTLTOOL_MERGE) $(wildcard $(top_srcdir)/po/*.po) ; LC_ALL=C $(INTLTOOL_MERGE) -x -u -c $(top_builddir)/po/.intltool-merge-cache $(top_srcdir)/po $< $@'LDFLAGS=''LIBOBJS=''LIBS=''LIBTOOL='$(SHELL) $(top_builddir)/libtool'LN_S='ln -s'LTLIBOBJS=''MAINT=''MAINTAINER_MODE_FALSE='#'MAINTAINER_MODE_TRUE=''MAKEINFO='${SHELL} /home/kikidonk/Devel/gnome/epiphany/missing --run makeinfo'MKINSTALLDIRS=''MOZILLA='firefox'MOZILLA_EXTRA_LIBS=''MOZILLA_FLAVOUR='toolkit'MOZILLA_HOME='/usr/lib/mozilla-firefox'MOZILLA_INCLUDE_ROOT='/usr/include/mozilla-firefox'MOZILLA_PREFIX='/usr'MSGFMT=''NO_STRICT_ALIASING_CFLAGS=''OBJEXT='o'OMF_DIR=''PACKAGE='epiphany'PACKAGE_BUGREPORT='http://bugzilla.gnome.org/enter_bug.cgi?product=epiphany'PACKAGE_NAME='GNOME Web Browser'PACKAGE_STRING='GNOME Web Browser 1.9.9'PACKAGE_TARNAME='epiphany'PACKAGE_VERSION='1.9.9'PATH_SEPARATOR=':'PKG_CONFIG='/home/kikidonk/Devel/gnome-install/bin/pkg-config'POFILES=''POSUB=''PO_IN_DATADIR_FALSE=''PO_IN_DATADIR_TRUE=''PYGTK_CFLAGS=''PYGTK_CODEGEN=''PYGTK_DEFSDIR=''PYGTK_H2DEF=''PYGTK_LIBS=''PYTHON=''PYTHON_CFLAGS=''PYTHON_EXEC_PREFIX=''PYTHON_EXTRA_LIBS=''PYTHON_INCLUDES=''PYTHON_LIBS=''PYTHON_LIB_LOC=''PYTHON_PLATFORM=''PYTHON_PREFIX=''PYTHON_VERSION=''RANLIB='ranlib'SET_MAKE=''SHELL='/bin/sh'STRIP='strip'USE_NLS=''VERSION='1.9.9'WARN_CFLAGS='-Wall -Wmissing-prototypes -Wnested-externs -Wpointer-arith -Wno-sign-compare -Werror 'WARN_CXXFLAGS='-g -O2 -Wall -Wno-unused 'XGETTEXT=''ac_ct_AR='ar'ac_ct_CC='gcc'ac_ct_CXX='g++'ac_ct_F77=''ac_ct_RANLIB='ranlib'ac_ct_STRIP='strip'ac_pt_PKG_CONFIG='/home/kikidonk/Devel/gnome-install/bin/pkg-config'am__fastdepCC_FALSE='#'am__fastdepCC_TRUE=''am__fastdepCXX_FALSE='#'am__fastdepCXX_TRUE=''am__include='include'am__leading_dot='.'am__quote=''am__tar='${AMTAR} chof - "$$tardir"'am__untar='${AMTAR} xf -'bindir='${exec_prefix}/bin'build='i686-pc-linux-gnu'build_alias=''build_cpu='i686'build_os='linux-gnu'build_vendor='pc'datadir='${prefix}/share'exec_prefix='NONE'host='i686-pc-linux-gnu'host_alias=''host_cpu='i686'host_os='linux-gnu'host_vendor='pc'includedir='${prefix}/include'infodir='${prefix}/info'install_sh='/home/kikidonk/Devel/gnome/epiphany/install-sh'libdir='${exec_prefix}/lib'libexecdir='${exec_prefix}/libexec'localstatedir='${prefix}/var'mandir='${prefix}/man'mkdir_p='mkdir -p --'oldincludedir='/usr/include'pkgpyexecdir=''pkgpythondir=''prefix='/home/kikidonk/Devel/gnome-install'program_transform_name='s,x,x,'pyexecdir=''pythondir=''sbindir='${exec_prefix}/sbin'sharedstatedir='${prefix}/com'sysconfdir='${prefix}/etc'target_alias=''## ----------- #### confdefs.h. #### ----------- ###define GNOME_ENABLE_DEBUG 1#define HAVE_DLFCN_H 1#define HAVE_EXECINFO_H 1#define HAVE_GECKO_1_7 1#define HAVE_GECKO_1_8 1#define HAVE_INTTYPES_H 1#define HAVE_MEMORY_H 1#define HAVE_MKDTEMP 1#define HAVE_MOZILLA_TOOLKIT 1#define HAVE_STDINT_H 1#define HAVE_STDLIB_H 1#define HAVE_STRINGS_H 1#define HAVE_STRING_H 1#define HAVE_SYS_STAT_H 1#define HAVE_SYS_TYPES_H 1#define HAVE_TYPEAHEADFIND 1#define HAVE_UNISTD_H 1#define MAINTAINER_MODE 1#define MOZ_NSICONTENTPOLICY_VARIANT 2#define MOZ_NSIFILEPICKER_NSASTRING_ 1#define PACKAGE "epiphany"#define PACKAGE_BUGREPORT "http://bugzilla.gnome.org/enter_bug.cgi?product=epiphany"#define PACKAGE_NAME "GNOME Web Browser"#define PACKAGE_STRING "GNOME Web Browser 1.9.9"#define PACKAGE_TARNAME "epiphany"#define PACKAGE_VERSION "1.9.9"#define STDC_HEADERS 1#define STDC_HEADERS 1#define VERSION "1.9.9"#endif#ifdef __cplusplusextern "C" void std::exit (int) throw (); using std::exit;configure: exit 1