All pastes #441138 Raw Edit

Miscellany

public text v1 · immutable
·published 2007-04-15 15:00 UTC
rendered paste body
Administrator@KAMA /d/mplayer-testclips/mplayer/vidix
$ make
gcc -I../libavcodec -I../libavformat -Wdeclaration-after-statement -I. -I.. -I../libavutil -O4 -march=i486 -mtune=i686 -pipe -ffast-math -fomit-frame-pointer -D_LARGEFILE_SOURCE -D_FILE_OFFSET_BITS=64 -D_LARGEFILE64_SOURCE -I/usr/local/include/freetype2 -I/usr/local/include   -c -o pm2_vid.o pm2_vid.c
pm2_vid.c:79: error: syntax error before "pm2_card_ids"
pm2_vid.c:83: warning: data definition has no type or storage class
pm2_vid.c:85: error: syntax error before "vendor"
pm2_vid.c: In function `find_chip':
pm2_vid.c:87: error: `u_int' undeclared (first use in this function)
pm2_vid.c:87: error: (Each undeclared identifier is reported only once
pm2_vid.c:87: error: for each function it appears in.)
pm2_vid.c:87: error: syntax error before "vci"
pm2_vid.c:90: error: `vci' undeclared (first use in this function)
pm2_vid.c: At top level:
pm2_vid.c:189: error: syntax error before "ppcodes"
pm2_vid.c:223: warning: data definition has no type or storage class
pm2_vid.c: In function `pm2_config_playback':
pm2_vid.c:229: error: `u_int' undeclared (first use in this function)
pm2_vid.c:229: error: syntax error before "src_w"
pm2_vid.c:232: error: syntax error before "stride"
pm2_vid.c:235: error: syntax error before "ppcode"
pm2_vid.c:242: error: `format' undeclared (first use in this function)
pm2_vid.c:248: error: `src_w' undeclared (first use in this function)
pm2_vid.c:249: error: `src_h' undeclared (first use in this function)
pm2_vid.c:251: error: `drw_w' undeclared (first use in this function)
pm2_vid.c:252: error: `drw_h' undeclared (first use in this function)
pm2_vid.c:254: error: `sstr' undeclared (first use in this function)
pm2_vid.c:256: error: `stride' undeclared (first use in this function)
pm2_vid.c:260: error: `ppcode' undeclared (first use in this function)
pm2_vid.c:261: error: `pitch' undeclared (first use in this function)
pm2_vid.c:264: error: `sppc' undeclared (first use in this function)
pm2_vid.c:291: error: syntax error before "u_long"
pm2_vid.c:291: error: `u_char' undeclared (first use in this function)
pm2_vid.c:291: error: syntax error before ')' token
pm2_vid.c:292: error: syntax error before "u_long"
pm2_vid.c:292: error: syntax error before ')' token
pm2_vid.c:293: error: syntax error before "u_long"
pm2_vid.c:293: error: syntax error before ')' token
pm2_vid.c:294: error: syntax error before "u_long"
pm2_vid.c:294: error: syntax error before ')' token
pm2_vid.c:295: error: syntax error before "u_long"
pm2_vid.c:295: error: syntax error before ')' token
pm2_vid.c:296: error: syntax error before "u_long"
pm2_vid.c:296: error: syntax error before ')' token
pm2_vid.c:297: error: syntax error before "u_long"
pm2_vid.c:297: error: syntax error before ')' token
pm2_vid.c:299: error: syntax error before "u_long"
pm2_vid.c:299: error: syntax error before ')' token
pm2_vid.c:300: error: syntax error before "u_long"
pm2_vid.c:300: error: syntax error before ')' token
pm2_vid.c:302: error: syntax error before "u_long"
pm2_vid.c:302: error: syntax error before ')' token
pm2_vid.c:303: error: syntax error before "u_long"
pm2_vid.c:303: error: syntax error before ')' token
pm2_vid.c:304: error: syntax error before "u_long"
pm2_vid.c:304: error: syntax error before ')' token
pm2_vid.c:306: error: syntax error before "u_long"
pm2_vid.c:306: error: syntax error before ')' token
pm2_vid.c:307: error: syntax error before "u_long"
pm2_vid.c:307: error: syntax error before ')' token
pm2_vid.c:308: error: syntax error before "u_long"
pm2_vid.c:308: error: syntax error before ')' token
pm2_vid.c:309: error: syntax error before "u_long"
pm2_vid.c:309: error: syntax error before ')' token
pm2_vid.c:310: error: syntax error before "u_long"
pm2_vid.c:310: error: syntax error before ')' token
pm2_vid.c:311: error: syntax error before "u_long"
pm2_vid.c:311: error: syntax error before ')' token
pm2_vid.c:312: error: syntax error before "u_long"
pm2_vid.c:312: error: syntax error before ')' token
pm2_vid.c:313: error: syntax error before "u_long"
pm2_vid.c:313: error: syntax error before ')' token
pm2_vid.c:314: error: syntax error before "u_long"
pm2_vid.c:314: error: syntax error before ')' token
pm2_vid.c:316: error: syntax error before "u_long"
pm2_vid.c:316: error: syntax error before ')' token
pm2_vid.c:317: error: syntax error before "u_long"
pm2_vid.c:317: error: syntax error before ')' token
pm2_vid.c:319: error: syntax error before "u_long"
pm2_vid.c:319: error: syntax error before ')' token
pm2_vid.c:320: error: syntax error before "u_long"
pm2_vid.c:320: error: syntax error before ')' token
pm2_vid.c:321: error: syntax error before "u_long"
pm2_vid.c:321: error: syntax error before ')' token
pm2_vid.c:322: error: syntax error before "u_long"
pm2_vid.c:322: error: syntax error before ')' token
pm2_vid.c: In function `pm2_playback_off':
pm2_vid.c:338: error: syntax error before "u_long"
pm2_vid.c:338: error: `u_char' undeclared (first use in this function)
pm2_vid.c:338: error: syntax error before ')' token
pm2_vid.c:339: error: syntax error before "u_long"
pm2_vid.c:339: error: syntax error before ')' token
pm2_vid.c:340: error: syntax error before "u_long"
pm2_vid.c:340: error: syntax error before ')' token
pm2_vid.c:341: error: syntax error before "u_long"
pm2_vid.c:341: error: syntax error before ')' token
pm2_vid.c: In function `pm2_frame_select':
pm2_vid.c:347: error: syntax error before "u_long"
pm2_vid.c:347: error: `u_char' undeclared (first use in this function)
pm2_vid.c:347: error: syntax error before ')' token
pm2_vid.c:348: error: syntax error before "u_long"
pm2_vid.c:348: error: syntax error before ')' token
pm2_vid.c: At top level:
pm2_vid.c:359: warning: initialization from incompatible pointer type
make: *** [pm2_vid.o] Error 1