cms -I/usr/local/pkg/include -I/usr/share/qt3/include -I/usr/share/qt3/include src/videoLUTutils/LUTutil-X11.cpp
src/videoLUTutils/LUTutil-X11.cpp:52:38: error: X11/extensions/xf86vmode.h: No such file or directory
src/videoLUTutils/LUTutil-X11.cpp: In destructor 'gamma_ramp::~gamma_ramp()':
src/videoLUTutils/LUTutil-X11.cpp:91: warning: NULL used in arithmetic
src/videoLUTutils/LUTutil-X11.cpp: In member function 'int gamma_ramp::getGammaRampSize(int)':
src/videoLUTutils/LUTutil-X11.cpp:113: error: 'XF86VidModeQueryExtension' was not declared in this scope
src/videoLUTutils/LUTutil-X11.cpp:119: error: 'XF86VidModeGetGammaRampSize' was not declared in this scope
src/videoLUTutils/LUTutil-X11.cpp: In member function 'void gamma_ramp::getGammaRamp()':
src/videoLUTutils/LUTutil-X11.cpp:144: error: 'XF86VidModeQueryExtension' was not declared in this scope
src/videoLUTutils/LUTutil-X11.cpp:151: error: 'XF86VidModeGetGammaRamp' was not declared in this scope
src/videoLUTutils/LUTutil-X11.cpp: In member function 'void gamma_ramp::setGammaRamp()':
src/videoLUTutils/LUTutil-X11.cpp:172: error: 'XF86VidModeQueryExtension' was not declared in this scope
src/videoLUTutils/LUTutil-X11.cpp:179: error: 'XF86VidModeSetGammaRamp' was not declared in this scope
scons: *** [build/linux/videoLUTutils/LUTutil-X11.o] Error 1
scons: building terminated because of errors.