[exec] config.status: executing gen-classlist commands
[exec] config.status: executing copy-vmresources commands
[exec] Making all in lib
[exec] make[1]: Entering directory `/usr/local/src/jikesrvm-2.9.0.1/components/classpath/93/classpath/lib'
[exec] mkdir -p ../gnu/java/locale
[exec] /usr/local/src/jikesrvm-2.9.0.1/components/classpath/93/classpath/scripts/generate-locale-list.sh > ../gnu/java/locale/LocaleData.java
[exec] true
[exec] top_builddir=.. top_srcdir=/usr/local/src/jikesrvm-2.9.0.1/components/classpath/93/classpath /bin/sh ./gen-classlist.sh standard
[exec] Adding java source files from srcdir '/usr/local/src/jikesrvm-2.9.0.1/components/classpath/93/classpath'.
[exec] Adding java source files from VM directory /usr/local/src/jikesrvm-2.9.0.1/components/classpath/93/classpath/vm/reference
[exec] 1.5 -warn:-deprecation,serial,typeHiding,unchecked,unused,varargsCast -proceedOnError -bootclasspath '' -classpath /usr/local/src/jikesrvm-2.9.0.1/components/classpath/93/classpath/vm/reference:/usr/local/src/jikesrvm-2.9.0.1/components/classpath/93/classpath:/usr/local/src/jikesrvm-2.9.0.1/components/classpath/93/classpath/external/w3c_dom:/usr/local/src/jikesrvm-2.9.0.1/components/classpath/93/classpath/external/sax:/usr/local/src/jikesrvm-2.9.0.1/components/classpath/93/classpath/external/relaxngDatatype:/usr/local/src/jikesrvm-2.9.0.1/components/classpath/93/classpath/external/jsr166:.:: -d . @classes
[exec] make[1]: 1.5: Command not found
[exec] make[1]: [compile-classes] Error 127 (ignored)
[exec] touch compile-classes
[exec] touch resources
[exec] if test "" != ""; then -r -D glibj.zip gnu java javax org sun META-INF > /dev/null; fi
[exec] if test "/usr/bin/fastjar" != ""; then /usr/bin/fastjar cf glibj.zip gnu java javax org sun META-INF; fi
[exec] sun: No such file or directory
[exec] Error adding sun to jar archive!
[exec] make[1]: *** [glibj.zip] Error 1
[exec] make[1]: Leaving directory `/usr/local/src/jikesrvm-2.9.0.1/components/classpath/93/classpath/lib'
[exec] make: *** [all-recursive] Error 1
BUILD FAILED
/usr/local/src/jikesrvm-2.9.0.1/build.xml:140: The following error occurred while executing this line:
/usr/local/src/jikesrvm-2.9.0.1/build/components/classpath.xml:169: The following error occurred while executing this line:
/usr/local/src/jikesrvm-2.9.0.1/build/components/base.xml:58: The following error occurred while executing this line:
/usr/local/src/jikesrvm-2.9.0.1/build/components/base.xml:64: The following error occurred while executing this line:
/usr/local/src/jikesrvm-2.9.0.1/build/components/classpath.xml:136: exec returned: 2
Total time: 31 seconds