All pastes #439017 Raw Edit

Stuff

public text v1 · immutable
·published 2007-04-14 00:11 UTC
rendered paste body
mike@mike-desktop:~$ cd gimp-hdrtools/
mike@mike-desktop:~/gimp-hdrtools$ make
gcc -c -g -O2 -Wall `gimptool-2.0 --cflags` -DGETTEXT_PACKAGE hdrtools.c
/bin/sh: gimptool-2.0: not found
hdrtools.c:28:21: error: gtk/gtk.h: No such file or directory
hdrtools.c:30:26: error: libgimp/gimp.h: No such file or directory
hdrtools.c:31:28: error: libgimp/gimpui.h: No such file or directory
hdrtools.c:68: error: expected ‘=’, ‘,’, ‘;’, ‘asm’ or ‘__attribute__’ before ‘g_run_interactive’
hdrtools.c:72: warning: type defaults to ‘int’ in declaration of ‘gchar’
hdrtools.c:72: error: expected ‘;’, ‘,’ or ‘)’ before ‘*’ token
hdrtools.c:78: error: expected ‘=’, ‘,’, ‘;’, ‘asm’ or ‘__attribute__’ before ‘read_rgbe_image’
hdrtools.c:79: error: expected ‘=’, ‘,’, ‘;’, ‘asm’ or ‘__attribute__’ before ‘write_rgbe_image’
hdrtools.c:81: error: expected ‘)’ before ‘*’ token
hdrtools.c:86: error: expected ‘)’ before ‘*’ token
hdrtools.c:87: error: expected ‘)’ before ‘*’ token
hdrtools.c:88: error: expected ‘)’ before ‘*’ token
hdrtools.c:89: error: expected ‘)’ before ‘*’ token
hdrtools.c:90: error: expected ‘)’ before ‘*’ token
hdrtools.c:94: error: expected ‘=’, ‘,’, ‘;’, ‘asm’ or ‘__attribute__’ before ‘PLUG_IN_INFO’
hdrtools.c:109: error: expected specifier-qualifier-list before ‘gboolean’
hdrtools.c:117: warning: excess elements in struct initializer
hdrtools.c:117: warning: (near initialization for ‘g_tonemap_vals’)
hdrtools.c:117: warning: excess elements in struct initializer
hdrtools.c:117: warning: (near initialization for ‘g_tonemap_vals’)
hdrtools.c:117: warning: excess elements in struct initializer
hdrtools.c:117: warning: (near initialization for ‘g_tonemap_vals’)
hdrtools.c:117: warning: excess elements in struct initializer
hdrtools.c:117: warning: (near initialization for ‘g_tonemap_vals’)
hdrtools.c:117: warning: excess elements in struct initializer
hdrtools.c:117: warning: (near initialization for ‘g_tonemap_vals’)
hdrtools.c:117: warning: excess elements in struct initializer
hdrtools.c:117: warning: (near initialization for ‘g_tonemap_vals’)
hdrtools.c:117: warning: excess elements in struct initializer
hdrtools.c:117: warning: (near initialization for ‘g_tonemap_vals’)
hdrtools.c:117: warning: excess elements in struct initializer
hdrtools.c:117: warning: (near initialization for ‘g_tonemap_vals’)
hdrtools.c:129: error: expected specifier-qualifier-list before ‘gboolean’
hdrtools.c:131: warning: excess elements in struct initializer
hdrtools.c:131: warning: (near initialization for ‘g_rgbd8_vals’)
hdrtools.c:131: warning: excess elements in struct initializer
hdrtools.c:131: warning: (near initialization for ‘g_rgbd8_vals’)
hdrtools.c:135: warning: return type defaults to ‘int’
hdrtools.c: In function ‘MAIN’:
hdrtools.c:136: error: expected ‘=’, ‘,’, ‘;’, ‘asm’ or ‘__attribute__’ before ‘{’ token
hdrtools.c:284: warning: type defaults to ‘int’ in declaration of ‘gchar’
hdrtools.c:284: error: expected ‘;’, ‘,’ or ‘)’ before ‘*’ token
hdrtools.c:580: error: expected ‘=’, ‘,’, ‘;’, ‘asm’ or ‘__attribute__’ before ‘{’ token
hdrtools.c:630: error: expected ‘=’, ‘,’, ‘;’, ‘asm’ or ‘__attribute__’ before ‘{’ token
hdrtools.c:638: error: expected ‘=’, ‘,’, ‘;’, ‘asm’ or ‘__attribute__’ before ‘{’ token
hdrtools.c:756: error: expected ‘=’, ‘,’, ‘;’, ‘asm’ or ‘__attribute__’ before ‘read_rgbe_image’
hdrtools.c:862: error: expected ‘=’, ‘,’, ‘;’, ‘asm’ or ‘__attribute__’ before ‘{’ token
hdrtools.c:869: error: expected ‘=’, ‘,’, ‘;’, ‘asm’ or ‘__attribute__’ before ‘{’ token
hdrtools.c:930: error: expected ‘=’, ‘,’, ‘;’, ‘asm’ or ‘__attribute__’ before ‘{’ token
hdrtools.c:979: error: expected ‘=’, ‘,’, ‘;’, ‘asm’ or ‘__attribute__’ before ‘write_rgbe_image’
hdrtools.c:1043: error: expected ‘)’ before ‘*’ token
hdrtools.c:1129: error: expected ‘=’, ‘,’, ‘;’, ‘asm’ or ‘__attribute__’ before ‘{’ token
hdrtools.c:1180: error: expected ‘)’ before ‘*’ token
hdrtools.c:1333: error: expected ‘)’ before ‘*’ token
hdrtools.c:1439: error: expected ‘)’ before ‘*’ token
hdrtools.c:1448: error: expected ‘)’ before ‘*’ token
hdrtools.c:1457: error: expected ‘)’ before ‘*’ token
hdrtools.c:1463: error: expected ‘)’ before ‘*’ token
hdrtools.c:1470: error: expected ‘)’ before ‘*’ token
hdrtools.c:1483: error: expected ‘)’ before ‘*’ token
hdrtools.c:1567: error: expected ‘)’ before ‘*’ token
hdrtools.c:1649: error: expected ‘)’ before ‘*’ token
hdrtools.c:1708: error: expected ‘)’ before ‘*’ token
hdrtools.c:1722: error: expected ‘=’, ‘,’, ‘;’, ‘asm’ or ‘__attribute__’ before ‘{’ token
hdrtools.c:1813: error: expected ‘)’ before ‘*’ token
hdrtools.c:1827: error: expected ‘=’, ‘,’, ‘;’, ‘asm’ or ‘__attribute__’ before ‘{’ token
hdrtools.c:1916: error: expected ‘{’ at end of input
make: *** [hdrtools.o] Error 1