All pastes #438848 Raw Edit

Something

public text v1 · immutable
·published 2007-04-13 21:52 UTC
rendered paste body
x86_64-pc-linux-gnu-g++ -DHAVE_CONFIG_H -I. -I. -I.. -I/usr/kde/3.5/include -I/usr/qt/3/include -I.  -I/usr/kde/3.5/include  -DQT_THREAD_SUPPORT  -D_REENTRANT  -Wno-long-long -Wundef -ansi -D_XOPEN_SOURCE=500 -D_BSD_SOURCE -Wcast-align -Wconversion -Wchar-subscripts -Wall -W -Wpointer-arith -DNDEBUG -DNO_DEBUG -O2 -march=k8 -O2 -pipe -msse3 -Wformat-security -Wmissing-format-attribute -Wno-non-virtual-dtor -fno-exceptions -fno-check-new -fno-common  -c -o satellite.o satellite.cpp
hamlibwrapper.cpp: In member function 'void hamlibWrapper::setFreqs(double, double, bool)':
hamlibwrapper.cpp:145: error: 'fabs' was not declared in this scope
hamlibwrapper.cpp:146: error: 'round' was not declared in this scope
hamlibwrapper.cpp:149: error: 'fabs' was not declared in this scope
hamlibwrapper.cpp:150: error: 'round' was not declared in this scope
hamlibwrapper.cpp: At global scope:
hamlibwrapper.cpp:143: warning: unused parameter 'n'
hamlibwrapper.cpp: In member function 'void hamlibWrapper::setHardwareFrequency(bool, freq_t)':
hamlibwrapper.cpp:269: error: 'round' was not declared in this scope
make[3]: *** [hamlibwrapper.o] Error 1
make[3]: *** Se espera a que terminen otras tareas....
make[3]: se sale del directorio `/var/tmp/portage/media-radio/ktrack-0.3.0_rc1-r1/work/ktrack-0.3.0-rc1/ktrack'
make[2]: *** [all-recursive] Error 1
make[2]: se sale del directorio `/var/tmp/portage/media-radio/ktrack-0.3.0_rc1-r1/work/ktrack-0.3.0-rc1/ktrack'
make[1]: *** [all-recursive] Error 1
make[1]: se sale del directorio `/var/tmp/portage/media-radio/ktrack-0.3.0_rc1-r1/work/ktrack-0.3.0-rc1'
make: *** [all] Error 2

!!! ERROR: media-radio/ktrack-0.3.0_rc1-r1 failed.
Call stack:
  ebuild.sh, line 1614:   Called dyn_compile
  ebuild.sh, line 971:   Called qa_call 'src_compile'
  environment, line 4801:   Called src_compile
  ebuild.sh, line 1304:   Called kde_src_compile
  kde.eclass, line 170:   Called kde_src_compile 'all'
  kde.eclass, line 340:   Called kde_src_compile 'myconf' 'configure' 'make'
  kde.eclass, line 336:   Called die

!!! died running emake, kde_src_compile:make
!!! If you need support, post the topmost build error, and the call stack if relevant.
!!! A complete build log is located at '/var/tmp/portage/media-radio/ktrack-0.3.0_rc1-r1/temp/build.log'.