make[1]: Entering directory `/home2/liquidsoap/src/pcre-ocaml-5.11.2/lib'
make[2]: Entering directory `/home2/liquidsoap/src/pcre-ocaml-5.11.2/lib'
ocamlc -c -cc "cc" -ccopt "-fPIC -O2 \
-DPIC \
-I/usr/include/pcre -o pcre_stubs.o " pcre_stubs.c
pcre_stubs.c: In function `pcre_callout_handler':
pcre_stubs.c:105: error: structure has no member named `pattern_position'
pcre_stubs.c:106: error: structure has no member named `next_item_length'
pcre_stubs.c: In function `pcre_exec_stub':
pcre_stubs.c:418: error: `PCRE_ERROR_PARTIAL' undeclared (first use in this function)
pcre_stubs.c:418: error: (Each undeclared identifier is reported only once
pcre_stubs.c:418: error: for each function it appears in.)
pcre_stubs.c:420: error: `PCRE_ERROR_BADPARTIAL' undeclared (first use in this function)
make[2]: *** [pcre_stubs.o] Error 2
make[2]: Leaving directory `/home2/liquidsoap/src/pcre-ocaml-5.11.2/lib'
make[1]: *** [byte-code-library] Error 2
make[1]: Leaving directory `/home2/liquidsoap/src/pcre-ocaml-5.11.2/lib'
make: *** [all] Error 2