os_tssync.c: In function `AnopeInit':
os_tssync.c:44: warning: implicit declaration of function `moduleMinVersion'
os_tssync.c:52: warning: implicit declaration of function `moduleSetType'
os_tssync.c:52: error: `THIRD' undeclared (first use in this function)
os_tssync.c:52: error: (Each undeclared identifier is reported only once
os_tssync.c:52: error: for each function it appears in.)
os_tssync.c:57: error: `MODULE_EXT' undeclared (first use in this function)
os_tssync.c: In function `AnopeFini':
os_tssync.c:72: error: `MODULE_EXT' undeclared (first use in this function)
os_tssync.c: In function `do_sync_ts':
os_tssync.c:78: error: `IRCDModule' undeclared (first use in this function)
os_tssync.c:86: warning: implicit declaration of function `anope_cmd_global'
os_tssync.c: In function `sync_callback':
os_tssync.c:95: error: `IRCDModule' undeclared (first use in this function)
os_tssync.c: In function `valid_ircd':
os_tssync.c:110: error: `IRCDModule' undeclared (first use in this function)
os_tssync.c: In function `load_config':
os_tssync.c:123: error: `Directive' undeclared (first use in this function)
os_tssync.c:123: error: syntax error before "confvalues"
os_tssync.c:121: warning: unused variable `i'
make[1]: *** [os_tssync.o] Error 1
make[1]: Leaving directory `/home/morbid/anope-1.6.5/modules'
make: *** [modules] Error 2