rendered paste body[root@localhost moko]# make openmoko-devel-image
( cd build ; . ../setup-env ; \
bitbake openmoko-devel-image )
NOTE: Using cache in '/home/moko/build/tmp/cache/fic-gta01'
NOTE: Handling BitBake files: \ (4323/4323) [100 %]
NOTE: Parsing finished. 4139 cached, 0 parsed, 184 skipped, 0 masked.
NOTE: build 200704121114: started
OE Build Configuration:
BB_VERSION = "1.6.7"
OE_REVISION = "<unknown>"
TARGET_ARCH = "arm"
TARGET_OS = "linux"
MACHINE = "fic-gta01"
DISTRO = "openmoko"
DISTRO_VERSION = ".dev-snapshot-20070412"
TARGET_FPU = "soft"
NOTE: preferred version 2.4 of glibc not available
NOTE: preferred version 2.4 of glibc-intermediate not available
NOTE: preferred version 2.4 of glibc not available
NOTE: Retrieved remote revisions: ['0', '1715', '0']
NOTE: Retrieved remote revisions: ['6c9ba919375db977aaad9146bf320c7afd07ae7a', '0', '1652']
NOTE: Retrieved remote revisions: ['0', '1715', '0']
NOTE: multiple providers are available (db3-native, db-native);
NOTE: consider defining PREFERRED_PROVIDER_virtual/db-native
NOTE: multiple providers are available (db3, db);
NOTE: consider defining PREFERRED_PROVIDER_virtual/db
NOTE: package gmp-4.2.1: started
NOTE: package gmp-4.2.1-r1: task do_compile: started
ERROR: function do_compile failed
ERROR: log data follows (/home/moko/build/tmp/work/armv4t-linux/gmp-4.2.1-r1/temp/log.do_compile.8843)
| NOTE: make
| make[1]: Entering directory `/home/moko/build/tmp/work/armv4t-linux/gmp-4.2.1-r1/gmp-4.2.1'
| make all-recursive
| make[2]: Entering directory `/home/moko/build/tmp/work/armv4t-linux/gmp-4.2.1-r1/gmp-4.2.1'
| Making all in tests
| make[3]: Entering directory `/home/moko/build/tmp/work/armv4t-linux/gmp-4.2.1-r1/gmp-4.2.1/tests'
| Making all in .
| make[4]: Entering directory `/home/moko/build/tmp/work/armv4t-linux/gmp-4.2.1-r1/gmp-4.2.1/tests'
| make[4]: Nothing to be done for `all-am'.
| make[4]: Leaving directory `/home/moko/build/tmp/work/armv4t-linux/gmp-4.2.1-r1/gmp-4.2.1/tests'
| Making all in devel
| make[4]: Entering directory `/home/moko/build/tmp/work/armv4t-linux/gmp-4.2.1-r1/gmp-4.2.1/tests/devel'
| make[4]: Nothing to be done for `all'.
| make[4]: Leaving directory `/home/moko/build/tmp/work/armv4t-linux/gmp-4.2.1-r1/gmp-4.2.1/tests/devel'
| Making all in mpn
| make[4]: Entering directory `/home/moko/build/tmp/work/armv4t-linux/gmp-4.2.1-r1/gmp-4.2.1/tests/mpn'
| make[4]: Nothing to be done for `all'.
| make[4]: Leaving directory `/home/moko/build/tmp/work/armv4t-linux/gmp-4.2.1-r1/gmp-4.2.1/tests/mpn'
| Making all in mpz
| make[4]: Entering directory `/home/moko/build/tmp/work/armv4t-linux/gmp-4.2.1-r1/gmp-4.2.1/tests/mpz'
| make[4]: Nothing to be done for `all'.
| make[4]: Leaving directory `/home/moko/build/tmp/work/armv4t-linux/gmp-4.2.1-r1/gmp-4.2.1/tests/mpz'
| Making all in mpq
| make[4]: Entering directory `/home/moko/build/tmp/work/armv4t-linux/gmp-4.2.1-r1/gmp-4.2.1/tests/mpq'
| make[4]: Nothing to be done for `all'.
| make[4]: Leaving directory `/home/moko/build/tmp/work/armv4t-linux/gmp-4.2.1-r1/gmp-4.2.1/tests/mpq'
| Making all in mpf
| make[4]: Entering directory `/home/moko/build/tmp/work/armv4t-linux/gmp-4.2.1-r1/gmp-4.2.1/tests/mpf'
| make[4]: Nothing to be done for `all'.
| make[4]: Leaving directory `/home/moko/build/tmp/work/armv4t-linux/gmp-4.2.1-r1/gmp-4.2.1/tests/mpf'
| Making all in rand
| make[4]: Entering directory `/home/moko/build/tmp/work/armv4t-linux/gmp-4.2.1-r1/gmp-4.2.1/tests/rand'
| make[4]: Nothing to be done for `all'.
| make[4]: Leaving directory `/home/moko/build/tmp/work/armv4t-linux/gmp-4.2.1-r1/gmp-4.2.1/tests/rand'
| Making all in misc
| make[4]: Entering directory `/home/moko/build/tmp/work/armv4t-linux/gmp-4.2.1-r1/gmp-4.2.1/tests/misc'
| make[4]: Nothing to be done for `all'.
| make[4]: Leaving directory `/home/moko/build/tmp/work/armv4t-linux/gmp-4.2.1-r1/gmp-4.2.1/tests/misc'
| Making all in cxx
| make[4]: Entering directory `/home/moko/build/tmp/work/armv4t-linux/gmp-4.2.1-r1/gmp-4.2.1/tests/cxx'
| make[4]: Nothing to be done for `all'.
| make[4]: Leaving directory `/home/moko/build/tmp/work/armv4t-linux/gmp-4.2.1-r1/gmp-4.2.1/tests/cxx'
| Making all in mpbsd
| make[4]: Entering directory `/home/moko/build/tmp/work/armv4t-linux/gmp-4.2.1-r1/gmp-4.2.1/tests/mpbsd'
| make[4]: Nothing to be done for `all'.
| make[4]: Leaving directory `/home/moko/build/tmp/work/armv4t-linux/gmp-4.2.1-r1/gmp-4.2.1/tests/mpbsd'
| make[3]: Leaving directory `/home/moko/build/tmp/work/armv4t-linux/gmp-4.2.1-r1/gmp-4.2.1/tests'
| Making all in mpn
| make[3]: Entering directory `/home/moko/build/tmp/work/armv4t-linux/gmp-4.2.1-r1/gmp-4.2.1/mpn'
| make[3]: Nothing to be done for `all'.
| make[3]: Leaving directory `/home/moko/build/tmp/work/armv4t-linux/gmp-4.2.1-r1/gmp-4.2.1/mpn'
| Making all in mpz
| make[3]: Entering directory `/home/moko/build/tmp/work/armv4t-linux/gmp-4.2.1-r1/gmp-4.2.1/mpz'
| /bin/sh ../arm-linux-libtool --tag=CC --mode=link ccache arm-linux-gcc -march=armv4t -mtune=arm920t -isystem/home/moko/build/tmp/staging/arm-linux/include -O -g -L/home/moko/build/tmp/staging/arm-linux/lib -Wl,-rpath-link,/home/moko/build/tmp/staging/arm-linux/lib -Wl,-O1 -o libmpz.la add.lo add_ui.lo abs.lo aorsmul.lo aorsmul_i.lo and.lo array_init.lo bin_ui.lo bin_uiui.lo cdiv_q.lo cdiv_q_ui.lo cdiv_qr.lo cdiv_qr_ui.lo cdiv_r.lo cdiv_r_ui.lo cdiv_ui.lo cfdiv_q_2exp.lo cfdiv_r_2exp.lo clear.lo clrbit.lo cmp.lo cmp_d.lo cmp_si.lo cmp_ui.lo cmpabs.lo cmpabs_d.lo cmpabs_ui.lo com.lo combit.lo cong.lo cong_2exp.lo cong_ui.lo divexact.lo divegcd.lo dive_ui.lo divis.lo divis_ui.lo divis_2exp.lo dump.lo export.lo fac_ui.lo fdiv_q.lo fdiv_q_ui.lo fdiv_qr.lo fdiv_qr_ui.lo fdiv_r.lo fdiv_r_ui.lo fdiv_ui.lo fib_ui.lo fib2_ui.lo fits_sint.lo fits_slong.lo fits_sshort.lo fits_uint.lo fits_ulong.lo fits_ushort.lo gcd.lo gcd_ui.lo gcdext.lo get_d.lo get_d_2exp.lo get_si.lo get_str.lo get_ui.lo getlimbn.lo hamdist.lo import.lo init.lo init2.lo inp_raw.lo inp_str.lo invert.lo ior.lo iset.lo iset_d.lo iset_si.lo iset_str.lo iset_ui.lo jacobi.lo kronsz.lo kronuz.lo kronzs.lo kronzu.lo lcm.lo lcm_ui.lo lucnum_ui.lo lucnum2_ui.lo millerrabin.lo mod.lo mul.lo mul_2exp.lo mul_si.lo mul_ui.lo n_pow_ui.lo neg.lo nextprime.lo out_raw.lo out_str.lo perfpow.lo perfsqr.lo popcount.lo pow_ui.lo powm.lo powm_ui.lo pprime_p.lo random.lo random2.lo realloc.lo realloc2.lo remove.lo root.lo rootrem.lo rrandomb.lo scan0.lo scan1.lo set.lo set_d.lo set_f.lo set_q.lo set_si.lo set_str.lo set_ui.lo setbit.lo size.lo sizeinbase.lo sqrt.lo sqrtrem.lo sub.lo sub_ui.lo swap.lo tdiv_ui.lo tdiv_q.lo tdiv_q_2exp.lo tdiv_q_ui.lo tdiv_qr.lo tdiv_qr_ui.lo tdiv_r.lo tdiv_r_2exp.lo tdiv_r_ui.lo tstbit.lo ui_pow_ui.lo ui_sub.lo urandomb.lo urandomm.lo xor.lo
| arm-linux-libtool: link: `rrandomb.lo' is not a valid libtool object
| make[3]: *** [libmpz.la] Error 1
| make[3]: Leaving directory `/home/moko/build/tmp/work/armv4t-linux/gmp-4.2.1-r1/gmp-4.2.1/mpz'
| make[2]: *** [all-recursive] Error 1
| make[2]: Leaving directory `/home/moko/build/tmp/work/armv4t-linux/gmp-4.2.1-r1/gmp-4.2.1'
| make[1]: *** [all] Error 2
| make[1]: Leaving directory `/home/moko/build/tmp/work/armv4t-linux/gmp-4.2.1-r1/gmp-4.2.1'
| FATAL: oe_runmake failed
NOTE: Task failed: /home/moko/build/tmp/work/armv4t-linux/gmp-4.2.1-r1/temp/log.do_compile.8843
NOTE: package gmp-4.2.1-r1: task do_compile: failed
ERROR: TaskFailed event exception, aborting
NOTE: package gmp-4.2.1: failed
ERROR: Build of openmoko-devel-image failed
make: *** [openmoko-devel-image] Error 1
[root@localhost moko]#