All pastes #435872 Raw Edit

Anonymous

public text v1 · immutable
·published 2007-04-12 05:40 UTC
rendered paste body
This file contains any messages produced by compilers while
running configure, to aid debugging if configure makes a mistake.

It was created by configure, which was
generated by GNU Autoconf 2.59.  Invocation command line was

  $ ./configure --prefix=/usr --host=x86_64-pc-linux-gnu --mandir=/usr/share/man --infodir=/usr/share/info --datadir=/usr/share --sysconfdir=/etc --localstatedir=/var/lib --datadir=/usr/share/apr-util-0 --with-apr=/usr --with-expat=/usr --with-ldap --with-gdbm --with-dbm=db45 --with-berkeley-db=/usr/include/db4.5:/usr/lib64 --libdir=/usr/lib64 --build=x86_64-pc-linux-gnu

## --------- ##
## Platform. ##
## --------- ##

hostname = ROHLING4
uname -m = x86_64
uname -r = 2.6.19-gentoo-r5
uname -s = Linux
uname -v = #5 SMP Tue Mar 13 18:02:08 CDT 2007

/usr/bin/uname -p = unknown
/bin/uname -X     = unknown

/bin/arch              = x86_64
/usr/bin/arch -k       = unknown
/usr/convex/getsysinfo = unknown
hostinfo               = unknown
/bin/machine           = unknown
/usr/bin/oslevel       = unknown
/bin/universe          = unknown

PATH: /usr/lib/ccache/bin
PATH: /usr/local/sbin
PATH: /sbin
PATH: /usr/sbin
PATH: /usr/lib64/portage/bin
PATH: /usr/local/bin
PATH: /bin
PATH: /usr/bin
PATH: /opt/bin
PATH: /usr/x86_64-pc-linux-gnu/gcc-bin/4.1.1
PATH: /opt/ati/bin
PATH: /opt/ati/sbin
PATH: /opt/blackdown-jdk-1.4.2.03/bin
PATH: /opt/blackdown-jdk-1.4.2.03/jre/bin
PATH: /usr/kde/3.5/sbin
PATH: /usr/kde/3.5/bin
PATH: /usr/kde/3.5/sbin
PATH: /usr/kde/3.5/bin
PATH: /usr/qt/3/bin
PATH: /usr/qt/3/bin


## ----------- ##
## Core tests. ##
## ----------- ##

configure:1581: checking build system type
configure:1599: result: x86_64-pc-linux-gnu
configure:1607: checking host system type
configure:1621: result: x86_64-pc-linux-gnu
configure:1629: checking target system type
configure:1643: result: x86_64-pc-linux-gnu
configure:1664: checking for working mkdir -p
configure:1680: result: yes
configure:1764: checking for chosen layout
configure:1766: result: apr-util
configure:1973: checking for APR
configure:2033: result: yes
configure:2119: checking for x86_64-pc-linux-gnu-gcc
configure:2145: result: x86_64-pc-linux-gnu-gcc
configure:2427: checking for C compiler version
configure:2430: x86_64-pc-linux-gnu-gcc --version </dev/null >&5
x86_64-pc-linux-gnu-gcc (GCC) 4.1.1 (Gentoo 4.1.1-r3)
Copyright (C) 2006 Free Software Foundation, Inc.
This is free software; see the source for copying conditions.  There is NO
warranty; not even for MERCHANTABILITY or FITNESS FOR A PARTICULAR PURPOSE.

configure:2433: $? = 0
configure:2435: x86_64-pc-linux-gnu-gcc -v </dev/null >&5
Using built-in specs.
Target: x86_64-pc-linux-gnu
Configured with: /var/tmp/portage/sys-devel/gcc-4.1.1-r3/work/gcc-4.1.1/configure --prefix=/usr --bindir=/usr/x86_64-pc-linux-gnu/gcc-bin/4.1.1 --includedir=/usr/lib/gcc/x86_64-pc-linux-gnu/4.1.1/include --datadir=/usr/share/gcc-data/x86_64-pc-linux-gnu/4.1.1 --mandir=/usr/share/gcc-data/x86_64-pc-linux-gnu/4.1.1/man --infodir=/usr/share/gcc-data/x86_64-pc-linux-gnu/4.1.1/info --with-gxx-include-dir=/usr/lib/gcc/x86_64-pc-linux-gnu/4.1.1/include/g++-v4 --host=x86_64-pc-linux-gnu --build=x86_64-pc-linux-gnu --disable-altivec --enable-nls --without-included-gettext --with-system-zlib --disable-checking --disable-werror --enable-secureplt --disable-libunwind-exceptions --enable-multilib --disable-libmudflap --disable-libssp --enable-java-awt=gtk --enable-objc-gc --enable-languages=c,c++,java,objc,obj-c++,fortran --enable-shared --enable-threads=posix --enable-__cxa_atexit --enable-clocale=gnu
Thread model: posix
gcc version 4.1.1 (Gentoo 4.1.1-r3)
configure:2438: $? = 0
configure:2440: x86_64-pc-linux-gnu-gcc -V </dev/null >&5
x86_64-pc-linux-gnu-gcc: '-V' option must have argument
configure:2443: $? = 1
configure:2466: checking for C compiler default output file name
configure:2469: x86_64-pc-linux-gnu-gcc -march=k8 -O2 -pipe -pthread  -DLINUX=2 -D_REENTRANT -D_GNU_SOURCE  conftest.c  >&5
configure:2472: $? = 0
configure:2518: result: a.out
configure:2523: checking whether the C compiler works
configure:2529: ./a.out
configure:2532: $? = 0
configure:2549: result: yes
configure:2556: checking whether we are cross compiling
configure:2558: result: no
configure:2561: checking for suffix of executables
configure:2563: x86_64-pc-linux-gnu-gcc -o conftest -march=k8 -O2 -pipe -pthread  -DLINUX=2 -D_REENTRANT -D_GNU_SOURCE  conftest.c  >&5
configure:2566: $? = 0
configure:2591: result: 
configure:2597: checking for suffix of object files
configure:2618: x86_64-pc-linux-gnu-gcc -c -march=k8 -O2 -pipe -pthread  -DLINUX=2 -D_REENTRANT -D_GNU_SOURCE conftest.c >&5
configure:2621: $? = 0
configure:2643: result: o
configure:2647: checking whether we are using the GNU C compiler
configure:2671: x86_64-pc-linux-gnu-gcc -c -march=k8 -O2 -pipe -pthread  -DLINUX=2 -D_REENTRANT -D_GNU_SOURCE conftest.c >&5
configure:2677: $? = 0
configure:2681: test -z 
			 || test ! -s conftest.err
configure:2684: $? = 0
configure:2687: test -s conftest.o
configure:2690: $? = 0
configure:2703: result: yes
configure:2709: checking whether x86_64-pc-linux-gnu-gcc accepts -g
configure:2730: x86_64-pc-linux-gnu-gcc -c -g  -DLINUX=2 -D_REENTRANT -D_GNU_SOURCE conftest.c >&5
configure:2736: $? = 0
configure:2740: test -z 
			 || test ! -s conftest.err
configure:2743: $? = 0
configure:2746: test -s conftest.o
configure:2749: $? = 0
configure:2760: result: yes
configure:2777: checking for x86_64-pc-linux-gnu-gcc option to accept ANSI C
configure:2847: x86_64-pc-linux-gnu-gcc  -c -march=k8 -O2 -pipe -pthread  -DLINUX=2 -D_REENTRANT -D_GNU_SOURCE conftest.c >&5
configure:2853: $? = 0
configure:2857: test -z 
			 || test ! -s conftest.err
configure:2860: $? = 0
configure:2863: test -s conftest.o
configure:2866: $? = 0
configure:2884: result: none needed
configure:2902: x86_64-pc-linux-gnu-gcc -c -march=k8 -O2 -pipe -pthread  -DLINUX=2 -D_REENTRANT -D_GNU_SOURCE conftest.c >&5
conftest.c:2: error: expected '=', ',', ';', 'asm' or '__attribute__' before 'me'
configure:2908: $? = 1
configure: failed program was:
| #ifndef __cplusplus
|   choke me
| #endif
configure:3047: checking how to run the C preprocessor
configure:3165: result: x86_64-pc-linux-gnu-gcc -E
configure:3189: x86_64-pc-linux-gnu-gcc -E  -DLINUX=2 -D_REENTRANT -D_GNU_SOURCE conftest.c
configure:3195: $? = 0
configure:3227: x86_64-pc-linux-gnu-gcc -E  -DLINUX=2 -D_REENTRANT -D_GNU_SOURCE conftest.c
conftest.c:9:28: error: ac_nonexistent.h: No such file or directory
configure:3233: $? = 1
configure: failed program was:
| /* confdefs.h.  */
| 
| #define PACKAGE_NAME ""
| #define PACKAGE_TARNAME ""
| #define PACKAGE_VERSION ""
| #define PACKAGE_STRING ""
| #define PACKAGE_BUGREPORT ""
| /* end confdefs.h.  */
| #include <ac_nonexistent.h>
configure:3277: checking for egrep
configure:3287: result: grep -E
configure:3292: checking for ANSI C header files
configure:3317: x86_64-pc-linux-gnu-gcc -c -march=k8 -O2 -pipe -pthread  -DLINUX=2 -D_REENTRANT -D_GNU_SOURCE conftest.c >&5
configure:3323: $? = 0
configure:3327: test -z 
			 || test ! -s conftest.err
configure:3330: $? = 0
configure:3333: test -s conftest.o
configure:3336: $? = 0
configure:3425: x86_64-pc-linux-gnu-gcc -o conftest -march=k8 -O2 -pipe -pthread  -DLINUX=2 -D_REENTRANT -D_GNU_SOURCE  conftest.c  >&5
conftest.c: In function 'main':
conftest.c:26: warning: incompatible implicit declaration of built-in function 'exit'
configure:3428: $? = 0
configure:3430: ./conftest
configure:3433: $? = 0
configure:3448: result: yes
configure:3472: checking for sys/types.h
configure:3488: x86_64-pc-linux-gnu-gcc -c -march=k8 -O2 -pipe -pthread  -DLINUX=2 -D_REENTRANT -D_GNU_SOURCE conftest.c >&5
configure:3494: $? = 0
configure:3498: test -z 
			 || test ! -s conftest.err
configure:3501: $? = 0
configure:3504: test -s conftest.o
configure:3507: $? = 0
configure:3518: result: yes
configure:3472: checking for sys/stat.h
configure:3488: x86_64-pc-linux-gnu-gcc -c -march=k8 -O2 -pipe -pthread  -DLINUX=2 -D_REENTRANT -D_GNU_SOURCE conftest.c >&5
configure:3494: $? = 0
configure:3498: test -z 
			 || test ! -s conftest.err
configure:3501: $? = 0
configure:3504: test -s conftest.o
configure:3507: $? = 0
configure:3518: result: yes
configure:3472: checking for stdlib.h
configure:3488: x86_64-pc-linux-gnu-gcc -c -march=k8 -O2 -pipe -pthread  -DLINUX=2 -D_REENTRANT -D_GNU_SOURCE conftest.c >&5
configure:3494: $? = 0
configure:3498: test -z 
			 || test ! -s conftest.err
configure:3501: $? = 0
configure:3504: test -s conftest.o
configure:3507: $? = 0
configure:3518: result: yes
configure:3472: checking for string.h
configure:3488: x86_64-pc-linux-gnu-gcc -c -march=k8 -O2 -pipe -pthread  -DLINUX=2 -D_REENTRANT -D_GNU_SOURCE conftest.c >&5
configure:3494: $? = 0
configure:3498: test -z 
			 || test ! -s conftest.err
configure:3501: $? = 0
configure:3504: test -s conftest.o
configure:3507: $? = 0
configure:3518: result: yes
configure:3472: checking for memory.h
configure:3488: x86_64-pc-linux-gnu-gcc -c -march=k8 -O2 -pipe -pthread  -DLINUX=2 -D_REENTRANT -D_GNU_SOURCE conftest.c >&5
configure:3494: $? = 0
configure:3498: test -z 
			 || test ! -s conftest.err
configure:3501: $? = 0
configure:3504: test -s conftest.o
configure:3507: $? = 0
configure:3518: result: yes
configure:3472: checking for strings.h
configure:3488: x86_64-pc-linux-gnu-gcc -c -march=k8 -O2 -pipe -pthread  -DLINUX=2 -D_REENTRANT -D_GNU_SOURCE conftest.c >&5
configure:3494: $? = 0
configure:3498: test -z 
			 || test ! -s conftest.err
configure:3501: $? = 0
configure:3504: test -s conftest.o
configure:3507: $? = 0
configure:3518: result: yes
configure:3472: checking for inttypes.h
configure:3488: x86_64-pc-linux-gnu-gcc -c -march=k8 -O2 -pipe -pthread  -DLINUX=2 -D_REENTRANT -D_GNU_SOURCE conftest.c >&5
configure:3494: $? = 0
configure:3498: test -z 
			 || test ! -s conftest.err
configure:3501: $? = 0
configure:3504: test -s conftest.o
configure:3507: $? = 0
configure:3518: result: yes
configure:3472: checking for stdint.h
configure:3488: x86_64-pc-linux-gnu-gcc -c -march=k8 -O2 -pipe -pthread  -DLINUX=2 -D_REENTRANT -D_GNU_SOURCE conftest.c >&5
configure:3494: $? = 0
configure:3498: test -z 
			 || test ! -s conftest.err
configure:3501: $? = 0
configure:3504: test -s conftest.o
configure:3507: $? = 0
configure:3518: result: yes
configure:3472: checking for unistd.h
configure:3488: x86_64-pc-linux-gnu-gcc -c -march=k8 -O2 -pipe -pthread  -DLINUX=2 -D_REENTRANT -D_GNU_SOURCE conftest.c >&5
configure:3494: $? = 0
configure:3498: test -z 
			 || test ! -s conftest.err
configure:3501: $? = 0
configure:3504: test -s conftest.o
configure:3507: $? = 0
configure:3518: result: yes
configure:3616: checking for ldap_init in -lldap50
configure:3646: x86_64-pc-linux-gnu-gcc -o conftest -march=k8 -O2 -pipe -pthread  -DLINUX=2 -D_REENTRANT -D_GNU_SOURCE  conftest.c -lldap50 -lnspr4 -lplc4 -lplds4 -liutil50 -llber50 -lldif50 -lnss3 -lprldap50 -lssl3 -lssldap50  >&5
/usr/lib/gcc/x86_64-pc-linux-gnu/4.1.1/../../../../x86_64-pc-linux-gnu/bin/ld: cannot find -lldap50
collect2: ld returned 1 exit status
configure:3652: $? = 1
configure: failed program was:
| /* confdefs.h.  */
| 
| #define PACKAGE_NAME ""
| #define PACKAGE_TARNAME ""
| #define PACKAGE_VERSION ""
| #define PACKAGE_STRING ""
| #define PACKAGE_BUGREPORT ""
| #define STDC_HEADERS 1
| #define HAVE_SYS_TYPES_H 1
| #define HAVE_SYS_STAT_H 1
| #define HAVE_STDLIB_H 1
| #define HAVE_STRING_H 1
| #define HAVE_MEMORY_H 1
| #define HAVE_STRINGS_H 1
| #define HAVE_INTTYPES_H 1
| #define HAVE_STDINT_H 1
| #define HAVE_UNISTD_H 1
| /* end confdefs.h.  */
| 
| /* Override any gcc2 internal prototype to avoid an error.  */
| #ifdef __cplusplus
| extern "C"
| #endif
| /* We use char because int might match the return type of a gcc2
|    builtin and then its argument prototype would still apply.  */
| char ldap_init ();
| int
| main ()
| {
| ldap_init ();
|   ;
|   return 0;
| }
configure:3678: result: no
configure:3875: checking for ldap_init in -lldapssl41
configure:3905: x86_64-pc-linux-gnu-gcc -o conftest -march=k8 -O2 -pipe -pthread  -DLINUX=2 -D_REENTRANT -D_GNU_SOURCE  conftest.c -lldapssl41 -lnspr3 -lplc3 -lplds3  >&5
/usr/lib/gcc/x86_64-pc-linux-gnu/4.1.1/../../../../x86_64-pc-linux-gnu/bin/ld: cannot find -lldapssl41
collect2: ld returned 1 exit status
configure:3911: $? = 1
configure: failed program was:
| /* confdefs.h.  */
| 
| #define PACKAGE_NAME ""
| #define PACKAGE_TARNAME ""
| #define PACKAGE_VERSION ""
| #define PACKAGE_STRING ""
| #define PACKAGE_BUGREPORT ""
| #define STDC_HEADERS 1
| #define HAVE_SYS_TYPES_H 1
| #define HAVE_SYS_STAT_H 1
| #define HAVE_STDLIB_H 1
| #define HAVE_STRING_H 1
| #define HAVE_MEMORY_H 1
| #define HAVE_STRINGS_H 1
| #define HAVE_INTTYPES_H 1
| #define HAVE_STDINT_H 1
| #define HAVE_UNISTD_H 1
| /* end confdefs.h.  */
| 
| /* Override any gcc2 internal prototype to avoid an error.  */
| #ifdef __cplusplus
| extern "C"
| #endif
| /* We use char because int might match the return type of a gcc2
|    builtin and then its argument prototype would still apply.  */
| char ldap_init ();
| int
| main ()
| {
| ldap_init ();
|   ;
|   return 0;
| }
configure:3937: result: no
configure:4134: checking for ldap_init in -lldapssl40
configure:4164: x86_64-pc-linux-gnu-gcc -o conftest -march=k8 -O2 -pipe -pthread  -DLINUX=2 -D_REENTRANT -D_GNU_SOURCE  conftest.c -lldapssl40   >&5
/usr/lib/gcc/x86_64-pc-linux-gnu/4.1.1/../../../../x86_64-pc-linux-gnu/bin/ld: cannot find -lldapssl40
collect2: ld returned 1 exit status
configure:4170: $? = 1
configure: failed program was:
| /* confdefs.h.  */
| 
| #define PACKAGE_NAME ""
| #define PACKAGE_TARNAME ""
| #define PACKAGE_VERSION ""
| #define PACKAGE_STRING ""
| #define PACKAGE_BUGREPORT ""
| #define STDC_HEADERS 1
| #define HAVE_SYS_TYPES_H 1
| #define HAVE_SYS_STAT_H 1
| #define HAVE_STDLIB_H 1
| #define HAVE_STRING_H 1
| #define HAVE_MEMORY_H 1
| #define HAVE_STRINGS_H 1
| #define HAVE_INTTYPES_H 1
| #define HAVE_STDINT_H 1
| #define HAVE_UNISTD_H 1
| /* end confdefs.h.  */
| 
| /* Override any gcc2 internal prototype to avoid an error.  */
| #ifdef __cplusplus
| extern "C"
| #endif
| /* We use char because int might match the return type of a gcc2
|    builtin and then its argument prototype would still apply.  */
| char ldap_init ();
| int
| main ()
| {
| ldap_init ();
|   ;
|   return 0;
| }
configure:4196: result: no
configure:4393: checking for ldap_init in -lldapssl30
configure:4423: x86_64-pc-linux-gnu-gcc -o conftest -march=k8 -O2 -pipe -pthread  -DLINUX=2 -D_REENTRANT -D_GNU_SOURCE  conftest.c -lldapssl30   >&5
/usr/lib/gcc/x86_64-pc-linux-gnu/4.1.1/../../../../x86_64-pc-linux-gnu/bin/ld: cannot find -lldapssl30
collect2: ld returned 1 exit status
configure:4429: $? = 1
configure: failed program was:
| /* confdefs.h.  */
| 
| #define PACKAGE_NAME ""
| #define PACKAGE_TARNAME ""
| #define PACKAGE_VERSION ""
| #define PACKAGE_STRING ""
| #define PACKAGE_BUGREPORT ""
| #define STDC_HEADERS 1
| #define HAVE_SYS_TYPES_H 1
| #define HAVE_SYS_STAT_H 1
| #define HAVE_STDLIB_H 1
| #define HAVE_STRING_H 1
| #define HAVE_MEMORY_H 1
| #define HAVE_STRINGS_H 1
| #define HAVE_INTTYPES_H 1
| #define HAVE_STDINT_H 1
| #define HAVE_UNISTD_H 1
| /* end confdefs.h.  */
| 
| /* Override any gcc2 internal prototype to avoid an error.  */
| #ifdef __cplusplus
| extern "C"
| #endif
| /* We use char because int might match the return type of a gcc2
|    builtin and then its argument prototype would still apply.  */
| char ldap_init ();
| int
| main ()
| {
| ldap_init ();
|   ;
|   return 0;
| }
configure:4455: result: no
configure:4652: checking for ldap_init in -lldapssl20
configure:4682: x86_64-pc-linux-gnu-gcc -o conftest -march=k8 -O2 -pipe -pthread  -DLINUX=2 -D_REENTRANT -D_GNU_SOURCE  conftest.c -lldapssl20   >&5
/usr/lib/gcc/x86_64-pc-linux-gnu/4.1.1/../../../../x86_64-pc-linux-gnu/bin/ld: cannot find -lldapssl20
collect2: ld returned 1 exit status
configure:4688: $? = 1
configure: failed program was:
| /* confdefs.h.  */
| 
| #define PACKAGE_NAME ""
| #define PACKAGE_TARNAME ""
| #define PACKAGE_VERSION ""
| #define PACKAGE_STRING ""
| #define PACKAGE_BUGREPORT ""
| #define STDC_HEADERS 1
| #define HAVE_SYS_TYPES_H 1
| #define HAVE_SYS_STAT_H 1
| #define HAVE_STDLIB_H 1
| #define HAVE_STRING_H 1
| #define HAVE_MEMORY_H 1
| #define HAVE_STRINGS_H 1
| #define HAVE_INTTYPES_H 1
| #define HAVE_STDINT_H 1
| #define HAVE_UNISTD_H 1
| /* end confdefs.h.  */
| 
| /* Override any gcc2 internal prototype to avoid an error.  */
| #ifdef __cplusplus
| extern "C"
| #endif
| /* We use char because int might match the return type of a gcc2
|    builtin and then its argument prototype would still apply.  */
| char ldap_init ();
| int
| main ()
| {
| ldap_init ();
|   ;
|   return 0;
| }
configure:4714: result: no
configure:4911: checking for ldap_init in -lldap
configure:4941: x86_64-pc-linux-gnu-gcc -o conftest -march=k8 -O2 -pipe -pthread  -DLINUX=2 -D_REENTRANT -D_GNU_SOURCE  conftest.c -lldap -llber  >&5
configure:4947: $? = 0
configure:4951: test -z 
			 || test ! -s conftest.err
configure:4954: $? = 0
configure:4957: test -s conftest
configure:4960: $? = 0
configure:4973: result: yes
configure:5020: checking for ldapssl_install_routines in -lldap
configure:5050: x86_64-pc-linux-gnu-gcc -o conftest -march=k8 -O2 -pipe -pthread  -DLINUX=2 -D_REENTRANT -D_GNU_SOURCE  conftest.c -lldap -llber  >&5
/var/tmp/portage/dev-libs/apr-util-0.9.12/temp/ccxIUOqb.o: In function `main':
conftest.c:(.text+0x7): undefined reference to `ldapssl_install_routines'
collect2: ld returned 1 exit status
configure:5056: $? = 1
configure: failed program was:
| /* confdefs.h.  */
| 
| #define PACKAGE_NAME ""
| #define PACKAGE_TARNAME ""
| #define PACKAGE_VERSION ""
| #define PACKAGE_STRING ""
| #define PACKAGE_BUGREPORT ""
| #define STDC_HEADERS 1
| #define HAVE_SYS_TYPES_H 1
| #define HAVE_SYS_STAT_H 1
| #define HAVE_STDLIB_H 1
| #define HAVE_STRING_H 1
| #define HAVE_MEMORY_H 1
| #define HAVE_STRINGS_H 1
| #define HAVE_INTTYPES_H 1
| #define HAVE_STDINT_H 1
| #define HAVE_UNISTD_H 1
| /* end confdefs.h.  */
| 
| /* Override any gcc2 internal prototype to avoid an error.  */
| #ifdef __cplusplus
| extern "C"
| #endif
| /* We use char because int might match the return type of a gcc2
|    builtin and then its argument prototype would still apply.  */
| char ldapssl_install_routines ();
| int
| main ()
| {
| ldapssl_install_routines ();
|   ;
|   return 0;
| }
configure:5082: result: no
configure:5089: checking for ldap_start_tls_s in -lldap
configure:5119: x86_64-pc-linux-gnu-gcc -o conftest -march=k8 -O2 -pipe -pthread  -DLINUX=2 -D_REENTRANT -D_GNU_SOURCE  conftest.c -lldap -llber  >&5
configure:5125: $? = 0
configure:5129: test -z 
			 || test ! -s conftest.err
configure:5132: $? = 0
configure:5135: test -s conftest
configure:5138: $? = 0
configure:5151: result: yes
configure:6983: checking for ber_init in -llber
configure:7013: x86_64-pc-linux-gnu-gcc -o conftest -march=k8 -O2 -pipe -pthread  -DLINUX=2 -D_REENTRANT -D_GNU_SOURCE  conftest.c -llber   >&5
configure:7019: $? = 0
configure:7023: test -z 
			 || test ! -s conftest.err
configure:7026: $? = 0
configure:7029: test -s conftest
configure:7032: $? = 0
configure:7045: result: yes
configure:7071: checking lber.h usability
configure:7083: x86_64-pc-linux-gnu-gcc -c -march=k8 -O2 -pipe -pthread  -DLINUX=2 -D_REENTRANT -D_GNU_SOURCE conftest.c >&5
configure:7089: $? = 0
configure:7093: test -z 
			 || test ! -s conftest.err
configure:7096: $? = 0
configure:7099: test -s conftest.o
configure:7102: $? = 0
configure:7112: result: yes
configure:7116: checking lber.h presence
configure:7126: x86_64-pc-linux-gnu-gcc -E  -DLINUX=2 -D_REENTRANT -D_GNU_SOURCE conftest.c
configure:7132: $? = 0
configure:7152: result: yes
configure:7187: checking for lber.h
configure:7194: result: yes
configure:7211: checking for ldap.h
configure:7230: x86_64-pc-linux-gnu-gcc -c -march=k8 -O2 -pipe -pthread  -DLINUX=2 -D_REENTRANT -D_GNU_SOURCE conftest.c >&5
configure:7236: $? = 0
configure:7240: test -z 
			 || test ! -s conftest.err
configure:7243: $? = 0
configure:7246: test -s conftest.o
configure:7249: $? = 0
configure:7260: result: yes
configure:7285: checking ldap_ssl.h usability
configure:7297: x86_64-pc-linux-gnu-gcc -c -march=k8 -O2 -pipe -pthread  -DLINUX=2 -D_REENTRANT -D_GNU_SOURCE conftest.c >&5
conftest.c:56:22: error: ldap_ssl.h: No such file or directory
configure:7303: $? = 1
configure: failed program was:
| /* confdefs.h.  */
| 
| #define PACKAGE_NAME ""
| #define PACKAGE_TARNAME ""
| #define PACKAGE_VERSION ""
| #define PACKAGE_STRING ""
| #define PACKAGE_BUGREPORT ""
| #define STDC_HEADERS 1
| #define HAVE_SYS_TYPES_H 1
| #define HAVE_SYS_STAT_H 1
| #define HAVE_STDLIB_H 1
| #define HAVE_STRING_H 1
| #define HAVE_MEMORY_H 1
| #define HAVE_STRINGS_H 1
| #define HAVE_INTTYPES_H 1
| #define HAVE_STDINT_H 1
| #define HAVE_UNISTD_H 1
| #define HAVE_LIBLBER 1
| #define HAVE_LBER_H 1
| #define HAVE_LDAP_H 1
| /* end confdefs.h.  */
| #include <stdio.h>
| #if HAVE_SYS_TYPES_H
| # include <sys/types.h>
| #endif
| #if HAVE_SYS_STAT_H
| # include <sys/stat.h>
| #endif
| #if STDC_HEADERS
| # include <stdlib.h>
| # include <stddef.h>
| #else
| # if HAVE_STDLIB_H
| #  include <stdlib.h>
| # endif
| #endif
| #if HAVE_STRING_H
| # if !STDC_HEADERS && HAVE_MEMORY_H
| #  include <memory.h>
| # endif
| # include <string.h>
| #endif
| #if HAVE_STRINGS_H
| # include <strings.h>
| #endif
| #if HAVE_INTTYPES_H
| # include <inttypes.h>
| #else
| # if HAVE_STDINT_H
| #  include <stdint.h>
| # endif
| #endif
| #if HAVE_UNISTD_H
| # include <unistd.h>
| #endif
| #include <ldap_ssl.h>
configure:7326: result: no
configure:7330: checking ldap_ssl.h presence
configure:7340: x86_64-pc-linux-gnu-gcc -E  -DLINUX=2 -D_REENTRANT -D_GNU_SOURCE conftest.c
conftest.c:22:22: error: ldap_ssl.h: No such file or directory
configure:7346: $? = 1
configure: failed program was:
| /* confdefs.h.  */
| 
| #define PACKAGE_NAME ""
| #define PACKAGE_TARNAME ""
| #define PACKAGE_VERSION ""
| #define PACKAGE_STRING ""
| #define PACKAGE_BUGREPORT ""
| #define STDC_HEADERS 1
| #define HAVE_SYS_TYPES_H 1
| #define HAVE_SYS_STAT_H 1
| #define HAVE_STDLIB_H 1
| #define HAVE_STRING_H 1
| #define HAVE_MEMORY_H 1
| #define HAVE_STRINGS_H 1
| #define HAVE_INTTYPES_H 1
| #define HAVE_STDINT_H 1
| #define HAVE_UNISTD_H 1
| #define HAVE_LIBLBER 1
| #define HAVE_LBER_H 1
| #define HAVE_LDAP_H 1
| /* end confdefs.h.  */
| #include <ldap_ssl.h>
configure:7366: result: no
configure:7401: checking for ldap_ssl.h
configure:7408: result: no
configure:7486: checking gdbm.h usability
configure:7498: x86_64-pc-linux-gnu-gcc -c -march=k8 -O2 -pipe -pthread  -DLINUX=2 -D_REENTRANT -D_GNU_SOURCE conftest.c >&5
configure:7504: $? = 0
configure:7508: test -z 
			 || test ! -s conftest.err
configure:7511: $? = 0
configure:7514: test -s conftest.o
configure:7517: $? = 0
configure:7527: result: yes
configure:7531: checking gdbm.h presence
configure:7541: x86_64-pc-linux-gnu-gcc -E  -DLINUX=2 -D_REENTRANT -D_GNU_SOURCE conftest.c
configure:7547: $? = 0
configure:7567: result: yes
configure:7602: checking for gdbm.h
configure:7609: result: yes
configure:7614: checking for gdbm_open in -lgdbm
configure:7644: x86_64-pc-linux-gnu-gcc -o conftest -march=k8 -O2 -pipe -pthread  -DLINUX=2 -D_REENTRANT -D_GNU_SOURCE  conftest.c -lgdbm   >&5
configure:7650: $? = 0
configure:7654: test -z 
			 || test ! -s conftest.err
configure:7657: $? = 0
configure:7660: test -s conftest
configure:7663: $? = 0
configure:7676: result: yes
configure:24881: error: Berkeley DB not found.

## ---------------- ##
## Cache variables. ##
## ---------------- ##

ac_cv_build=x86_64-pc-linux-gnu
ac_cv_build_alias=x86_64-pc-linux-gnu
ac_cv_c_compiler_gnu=yes
ac_cv_env_CC_set=
ac_cv_env_CC_value=
ac_cv_env_CFLAGS_set=set
ac_cv_env_CFLAGS_value='-march=k8 -O2 -pipe'
ac_cv_env_CPPFLAGS_set=
ac_cv_env_CPPFLAGS_value=
ac_cv_env_CPP_set=
ac_cv_env_CPP_value=
ac_cv_env_LDFLAGS_set=
ac_cv_env_LDFLAGS_value=
ac_cv_env_build_alias_set=set
ac_cv_env_build_alias_value=x86_64-pc-linux-gnu
ac_cv_env_host_alias_set=set
ac_cv_env_host_alias_value=x86_64-pc-linux-gnu
ac_cv_env_target_alias_set=
ac_cv_env_target_alias_value=
ac_cv_exeext=
ac_cv_header_gdbm_h=yes
ac_cv_header_inttypes_h=yes
ac_cv_header_lber_h=yes
ac_cv_header_ldap_h=yes
ac_cv_header_ldap_ssl_h=no
ac_cv_header_memory_h=yes
ac_cv_header_stdc=yes
ac_cv_header_stdint_h=yes
ac_cv_header_stdlib_h=yes
ac_cv_header_string_h=yes
ac_cv_header_strings_h=yes
ac_cv_header_sys_stat_h=yes
ac_cv_header_sys_types_h=yes
ac_cv_header_unistd_h=yes
ac_cv_host=x86_64-pc-linux-gnu
ac_cv_host_alias=x86_64-pc-linux-gnu
ac_cv_lib_gdbm_gdbm_open=yes
ac_cv_lib_lber_ber_init=yes
ac_cv_lib_ldap50___ldap_init=no
ac_cv_lib_ldap___ldap_init=yes
ac_cv_lib_ldap___ldap_start_tls_s=yes
ac_cv_lib_ldap___ldapssl_install_routines=no
ac_cv_lib_ldapssl20___ldap_init=no
ac_cv_lib_ldapssl30___ldap_init=no
ac_cv_lib_ldapssl40___ldap_init=no
ac_cv_lib_ldapssl41___ldap_init=no
ac_cv_mkdir_p=yes
ac_cv_objext=o
ac_cv_prog_CC=x86_64-pc-linux-gnu-gcc
ac_cv_prog_CPP='x86_64-pc-linux-gnu-gcc -E'
ac_cv_prog_cc_g=yes
ac_cv_prog_cc_stdc=
ac_cv_prog_egrep='grep -E'
ac_cv_target=x86_64-pc-linux-gnu
ac_cv_target_alias=x86_64-pc-linux-gnu

## ----------------- ##
## Output variables. ##
## ----------------- ##

APRUTIL_DOTTED_VERSION='0.9.12'
APRUTIL_EXPORT_LIBS='-lldap -llber'
APRUTIL_INCLUDES=''
APRUTIL_LDFLAGS=''
APRUTIL_LIBNAME=''
APRUTIL_LIBS='-lldap -llber'
APRUTIL_MAJOR_VERSION='0'
APRUTIL_PRIV_INCLUDES='-I/var/tmp/portage/dev-libs/apr-util-0.9.12/work/apr-util-0.9.12/include -I/var/tmp/portage/dev-libs/apr-util-0.9.12/work/apr-util-0.9.12/include/private'
APR_BUILD_DIR='/usr/share/apr-0/build'
APR_INCLUDES=' -I/usr/include/apr-0 '
APR_LIBS=' /usr/lib64/libapr-0.la -lrt -lm -lcrypt -lnsl  -lpthread -ldl'
APR_XML_DIR=''
APR_XML_EXPAT_OLD=''
APR_XML_SUBDIRS=''
APU_CONFIG_LOCATION='source'
CC='x86_64-pc-linux-gnu-gcc'
CFLAGS='-march=k8 -O2 -pipe -pthread'
CPP='x86_64-pc-linux-gnu-gcc -E'
CPPFLAGS=' -DLINUX=2 -D_REENTRANT -D_GNU_SOURCE'
DEFS=''
ECHO_C=''
ECHO_N='-n'
ECHO_T=''
EGREP='grep -E'
EXEEXT=''
EXTRA_OS_LINK=''
INCLUDE_RULES=''
LDFLAGS=''
LIBOBJS=''
LIBS=''
LTLIBOBJS=''
LT_NO_INSTALL=''
OBJEXT='o'
PACKAGE_BUGREPORT=''
PACKAGE_NAME=''
PACKAGE_STRING=''
PACKAGE_TARNAME=''
PACKAGE_VERSION=''
PATH_SEPARATOR=':'
SHELL='/bin/sh'
abs_builddir='/var/tmp/portage/dev-libs/apr-util-0.9.12/work/apr-util-0.9.12'
abs_srcdir='/var/tmp/portage/dev-libs/apr-util-0.9.12/work/apr-util-0.9.12'
ac_ct_CC=''
apu_db_header='db.h'
apu_db_version='0'
apu_has_ldap='1'
apu_has_ldap_netscape_ssl='0'
apu_has_ldap_starttls='1'
apu_have_db='0'
apu_have_gdbm='1'
apu_have_ndbm='0'
apu_have_sdbm='1'
apu_use_db='0'
apu_use_gdbm='0'
apu_use_ndbm='0'
apu_use_sdbm='0'
bindir='${exec_prefix}/bin'
build='x86_64-pc-linux-gnu'
build_alias='x86_64-pc-linux-gnu'
build_cpu='x86_64'
build_os='linux-gnu'
build_vendor='pc'
datadir='/usr/share/apr-util-0'
exec_prefix='${prefix}'
have_iconv=''
host='x86_64-pc-linux-gnu'
host_alias='x86_64-pc-linux-gnu'
host_cpu='x86_64'
host_os='linux-gnu'
host_vendor='pc'
includedir='${prefix}/include/apr-${APRUTIL_MAJOR_VERSION}'
infodir='/usr/share/info'
lber_h='#include <lber.h>'
ldap_h='#include <ldap.h>'
ldap_ssl_h=''
lib_target=''
libdir='/usr/lib64'
libexecdir='${exec_prefix}/modules'
localstatedir='/var/lib'
mandir='/usr/share/man'
oldincludedir='/usr/include'
prefix='/usr'
program_transform_name='s,x,x,'
sbindir='${exec_prefix}/bin'
sharedstatedir='${prefix}/com'
so_ext=''
sysconfdir='/etc'
target='x86_64-pc-linux-gnu'
target_alias=''
target_cpu='x86_64'
target_os='linux-gnu'
target_vendor='pc'
top_builddir='/var/tmp/portage/dev-libs/apr-util-0.9.12/work/apr-util-0.9.12'

## ----------- ##
## confdefs.h. ##
## ----------- ##

#define HAVE_INTTYPES_H 1
#define HAVE_LBER_H 1
#define HAVE_LDAP_H 1
#define HAVE_LIBLBER 1
#define HAVE_MEMORY_H 1
#define HAVE_STDINT_H 1
#define HAVE_STDLIB_H 1
#define HAVE_STRINGS_H 1
#define HAVE_STRING_H 1
#define HAVE_SYS_STAT_H 1
#define HAVE_SYS_TYPES_H 1
#define HAVE_UNISTD_H 1
#define PACKAGE_BUGREPORT ""
#define PACKAGE_NAME ""
#define PACKAGE_STRING ""
#define PACKAGE_TARNAME ""
#define PACKAGE_VERSION ""
#define STDC_HEADERS 1

configure: exit 1